program: Orca
programVersion: 5.0.2
elementType: Cl O O N C C C C C C C C C C C C C C C C C H H H H H H H H H H H H H H H H H H H H H H H H H H
charge: 0
multiplicity: 1
keywords: wb97x-d3
keywords: def2-TZVPP
keywords: def2/J RIJCOSX
keywords: DEFGRID2
keywords: scfconv7
keywords: smallprint printgap noloewdin
keywords: NOSOSCF
formula: C17H26ClNO2
InChI: InChI=1/C17H26ClNO2/c1-4-11-21-12-10-19(16(20)13-18)17-14(5-2)8-7-9-15(17)6-3/h7-9H,4-6,10-13H2,1-3H3
47 atoms
Cl -2.711138 -2.289439 1.243111
O  3.309875 -0.398706 -1.492651
O  0.725701 -2.629391 1.319539
N  0.060751 -0.818194 0.138355
C  -0.764704 0.335353 0.003055
C  -1.748434 0.342564 -0.998162
C  -0.539417 1.458555 0.810228
C  1.131744 -0.988053 -0.833842
C  -1.978062 -0.855177 -1.886151
C  0.50361 1.505277 1.901059
C  2.391691 -0.228881 -0.450128
C  -2.495029 1.500188 -1.178439
C  -1.312287 2.595075 0.591466
C  -0.062897 -1.727515 1.145497
C  -2.278135 2.620417 -0.39521
C  -3.43418 -1.094642 -2.265644
C  -0.066893 1.818944 3.283243
C  4.588703 0.122795 -1.236974
C  -1.278192 -1.590278 2.049434
C  4.65477 1.644804 -1.220929
C  4.121769 2.283871 -2.494615
H  1.355115 -2.048731 -0.938684
H  0.779346 -0.625935 -1.801043
H  -1.596128 -1.750948 -1.398818
H  -1.384698 -0.737059 -2.799395
H  1.061293 0.571213 1.9523
H  1.24103 2.27138 1.643728
H  2.147138 0.830914 -0.293335
H  2.787688 -0.619332 0.498762
H  -3.258077 1.532555 -1.944368
H  -1.14426 3.476967 1.197604
H  -2.863862 3.515616 -0.557527
H  -3.840328 -0.305654 -2.898222
H  -4.061006 -1.171046 -1.377677
H  -3.526517 -2.026944 -2.821918
H  0.728956 1.846697 4.027217
H  -0.78859 1.066859 3.602858
H  -0.572733 2.783318 3.309298
H  4.984343 -0.273276 -0.29008
H  5.230049 -0.257836 -2.035934
H  -1.523649 -0.564123 2.307585
H  -1.096177 -2.164067 2.954038
H  4.121859 2.043508 -0.352694
H  5.702401 1.922582 -1.074093
H  4.655668 1.918217 -3.373225
H  4.23468 3.36739 -2.468678
H  3.064803 2.065122 -2.641913
totalener: -1328.97044059 hartree
nucrepener: 1956.90310093 hartree
electener: -3285.87354152 hartree
oneelecener: -5704.64014139 hartree
twoeener: 2418.76659987 hartree
kineticenergy: 1324.29728795 hartree
xcener: -107.426103242488 hartree
chargesum: -0.0000000
charge: -0.129489 -0.324484 -0.371882 -0.015141 0.088566 -0.066229 -0.155151 0.005334 -0.221150 -0.245915 -0.022057 -0.050884 -0.046097 0.232396 -0.167987 -0.249418 -0.224616 0.009520 -0.072265 -0.128533 -0.235785 0.107368 0.100003 0.100432 0.089001 0.091876 0.098782 0.074065 0.085605 0.116524 0.115364 0.125545 0.076433 0.088458 0.090148 0.093282 0.072343 0.079576 0.072762 0.087476 0.114665 0.147160 0.055986 0.069531 0.072383 0.083658 0.082844
qa: -0.1295 -0.3245 -0.3719 -0.0151 0.0886 -0.0662 -0.1552 0.0053 -0.2211 -0.2459 -0.0221 -0.0509 -0.0461 0.2324 -0.1680 -0.2494 -0.2246 0.0095 -0.0723 -0.1285 -0.2358 0.1074 0.1000 0.1004 0.0890 0.0919 0.0988 0.0741 0.0856 0.1165 0.1154 0.1255 0.0764 0.0885 0.0901 0.0933 0.0723 0.0796 0.0728 0.0875 0.1147 0.1472 0.0560 0.0695 0.0724 0.0837 0.0828
va: 1.1516 1.9936 2.1358 2.9073 3.8021 3.7774 3.7280 3.7739 3.8949 3.9317 3.9517 3.8582 3.8704 4.1707 4.0687 3.9362 3.9262 3.9520 3.9712 3.8575 3.9348 1.0313 1.0120 1.0112 0.9974 1.0066 0.9941 0.9741 1.0046 1.0056 1.0038 1.0030 1.0027 1.0138 1.0069 1.0071 1.0111 1.0079 1.0042 0.9956 1.0241 1.0059 1.0054 1.0162 1.0055 1.0059 1.0083
dispcorr: -0.026320473 hartree
energy: -1328.996761061754
dipole: 18.89207 -18.84308 0.04899 19.19703 -17.54000 1.65703 -8.58803 8.63898 0.05095
magnitude: 1.65854 au
magnitude: 4.21567 debye
