program: Orca
programVersion: 5.0.2
elementType: Cl O O N C C C C C C C C C C C C C C C C C H H H H H H H H H H H H H H H H H H H H H H H H H H
charge: 0
multiplicity: 1
keywords: wb97x-d3
keywords: def2-TZVPP
keywords: def2/J RIJCOSX
keywords: DEFGRID2
keywords: scfconv7
keywords: smallprint printgap noloewdin
keywords: NOSOSCF
formula: C17H26ClNO2
InChI: InChI=1/C17H26ClNO2/c1-4-11-21-12-10-19(16(20)13-18)17-14(5-2)8-7-9-15(17)6-3/h7-9H,4-6,10-13H2,1-3H3
47 atoms
Cl -0.098001 -1.398782 2.688143
O  2.416991 0.66633 -0.995874
O  0.460315 -2.751457 -0.487766
N  -0.254161 -0.605425 -0.527566
C  -1.292817 0.303193 -0.151058
C  -2.579728 0.101749 -0.675715
C  -1.025613 1.371286 0.711629
C  0.428878 -0.378946 -1.800737
C  -2.909155 -1.000924 -1.650206
C  0.337637 1.672962 1.269806
C  1.944938 -0.410987 -1.753799
C  -3.598343 0.968388 -0.300933
C  -2.078754 2.214371 1.059672
C  -0.187659 -1.855634 0.010462
C  -3.35369 2.01936 0.565595
C  -2.993805 -0.493035 -3.088947
C  0.916629 2.96831 0.706407
C  3.816145 0.748312 -0.896449
C  -0.961982 -2.107539 1.29546
C  4.458869 -0.344717 -0.050768
C  3.880001 -0.448045 1.352479
H  0.105608 -1.126313 -2.532779
H  0.105208 0.595641 -2.16606
H  -3.871577 -1.437627 -1.372286
H  -2.18849 -1.817636 -1.602466
H  0.256726 1.751611 2.356703
H  1.025122 0.857649 1.069438
H  2.288894 -1.3737 -1.367544
H  2.299756 -0.338542 -2.794345
H  -4.597174 0.811128 -0.691133
H  -1.888209 3.034972 1.741062
H  -4.157898 2.681846 0.857836
H  -2.04714 -0.063776 -3.415907
H  -3.754511 0.28106 -3.189521
H  -3.247489 -1.303271 -3.772706
H  0.285563 3.829151 0.930352
H  1.03263 2.907518 -0.37408
H  1.900978 3.161505 1.133868
H  4.274517 0.757644 -1.896946
H  4.020648 1.721605 -0.442853
H  -1.010457 -3.181906 1.450298
H  -1.966629 -1.691291 1.288106
H  4.392065 -1.313705 -0.552523
H  5.527503 -0.117312 0.003107
H  2.836062 -0.759842 1.342553
H  3.931481 0.509736 1.873513
H  4.428737 -1.176794 1.948559
totalener: -1328.97112408 hartree
nucrepener: 2016.73900137 hartree
electener: -3345.71012545 hartree
oneelecener: -5825.00253470 hartree
twoeener: 2479.29240925 hartree
kineticenergy: 1324.29932558 hartree
xcener: -107.423622939423 hartree
chargesum: 0.0000000
charge: -0.124889 -0.310447 -0.384891 0.027356 0.046548 -0.137019 -0.054604 -0.079322 -0.191848 -0.109053 -0.027710 -0.043603 -0.060495 0.207181 -0.162695 -0.242913 -0.254631 -0.007625 -0.065502 -0.106775 -0.225635 0.095275 0.105911 0.089232 0.090732 0.090960 0.014710 0.109535 0.072947 0.114749 0.114040 0.124793 0.082783 0.081931 0.091525 0.079564 0.085631 0.078344 0.075006 0.081802 0.142565 0.125813 0.064384 0.064939 0.067292 0.069749 0.094361
qa: -0.1249 -0.3104 -0.3849 0.0274 0.0465 -0.1370 -0.0546 -0.0793 -0.1918 -0.1091 -0.0277 -0.0436 -0.0605 0.2072 -0.1627 -0.2429 -0.2546 -0.0076 -0.0655 -0.1068 -0.2256 0.0953 0.1059 0.0892 0.0907 0.0910 0.0147 0.1095 0.0729 0.1147 0.1140 0.1248 0.0828 0.0819 0.0915 0.0796 0.0856 0.0783 0.0750 0.0818 0.1426 0.1258 0.0644 0.0649 0.0673 0.0697 0.0944
va: 1.1491 1.9537 2.1162 2.8983 3.6716 3.8056 3.8615 3.9280 3.8867 3.8367 3.9613 3.8757 3.8603 4.1845 4.0423 3.9139 3.9326 3.9304 3.9534 3.8534 3.9305 1.0093 0.9999 1.0026 1.0157 1.0038 1.0683 0.9991 1.0009 1.0038 1.0047 1.0019 1.0029 1.0064 1.0061 1.0120 1.0162 1.0077 1.0049 0.9932 1.0085 1.0064 1.0078 1.0160 1.0125 1.0050 1.0088
dispcorr: -0.029391056 hartree
energy: -1329.000515135548
dipole: 10.52777 -11.05171 -0.52393 10.09128 -9.45743 0.63386 -14.15053 13.58023 -0.57030
magnitude: 1.00076 au
magnitude: 2.54373 debye
