program: Orca
programVersion: 5.0.2
elementType: Cl O O N C C C C C C C C C C C C C C C C C H H H H H H H H H H H H H H H H H H H H H H H H H H
charge: 0
multiplicity: 1
keywords: wb97x-d3
keywords: def2-TZVPP
keywords: def2/J RIJCOSX
keywords: DEFGRID2
keywords: scfconv7
keywords: smallprint printgap noloewdin
keywords: NOSOSCF
formula: C17H26ClNO2
InChI: InChI=1/C17H26ClNO2/c1-4-11-21-12-10-19(16(20)13-18)17-14(5-2)8-7-9-15(17)6-3/h7-9H,4-6,10-13H2,1-3H3
47 atoms
Cl 0.061705 -1.719269 2.448852
O  2.494007 0.788962 -0.960283
O  0.417729 -2.618084 -0.732498
N  -0.227905 -0.451497 -0.739615
C  -1.230599 0.49863 -0.369254
C  -2.468745 0.450017 -1.028572
C  -0.976363 1.455226 0.618672
C  0.554214 -0.19853 -1.948857
C  -2.797184 -0.576273 -2.083653
C  0.346246 1.597603 1.319654
C  2.061715 -0.254381 -1.787658
C  -3.454644 1.359392 -0.667523
C  -2.00118 2.335159 0.960459
C  -0.219009 -1.715602 -0.233149
C  -3.228963 2.292992 0.329252
C  -3.596519 -1.756906 -1.534442
C  1.038384 2.912523 0.969221
C  3.878861 0.822627 -0.698363
C  -1.013092 -1.963987 1.04052
C  4.218044 0.39313 0.719665
C  3.866512 -1.051696 1.041833
H  0.287264 -0.923876 -2.723447
H  0.267676 0.787659 -2.313928
H  -1.899592 -0.949074 -2.575435
H  -3.384126 -0.090023 -2.866424
H  0.177333 1.547633 2.398277
H  1.004444 0.770386 1.072914
H  2.366178 -1.233719 -1.40942
H  2.487665 -0.154848 -2.798125
H  -4.412784 1.330417 -1.173343
H  -1.823817 3.067867 1.738627
H  -4.008735 2.989169 0.609239
H  -3.031075 -2.321434 -0.79313
H  -3.861399 -2.449546 -2.333291
H  -4.519276 -1.423984 -1.059029
H  1.224225 2.980935 -0.100825
H  2.000081 2.984193 1.478731
H  0.444091 3.777796 1.265603
H  4.428399 0.196782 -1.41492
H  4.218956 1.851187 -0.856188
H  -1.328256 -3.004524 1.049058
H  -1.874627 -1.315541 1.172771
H  5.291278 0.552616 0.861681
H  3.717031 1.062544 1.424674
H  4.34971 -1.745172 0.351029
H  2.793054 -1.231659 0.997296
H  4.191043 -1.315562 2.048335
totalener: -1328.96877914 hartree
nucrepener: 2019.33891525 hartree
electener: -3348.30769439 hartree
oneelecener: -5830.15251049 hartree
twoeener: 2481.84481610 hartree
kineticenergy: 1324.29888395 hartree
xcener: -107.423329683907 hartree
chargesum: 0.0000000
charge: -0.124603 -0.317425 -0.379020 0.026561 -0.014663 -0.074701 -0.037735 -0.071600 -0.194540 -0.122677 -0.035368 -0.055600 -0.062028 0.220268 -0.155153 -0.243160 -0.264310 -0.010057 -0.104746 -0.101310 -0.235771 0.095373 0.108995 0.094575 0.086984 0.095073 0.018281 0.109709 0.078023 0.114644 0.114624 0.125298 0.077731 0.093116 0.084176 0.088775 0.079540 0.081939 0.075425 0.087407 0.148806 0.133033 0.068645 0.062132 0.079984 0.068173 0.087174
qa: -0.1246 -0.3174 -0.3790 0.0266 -0.0147 -0.0747 -0.0377 -0.0716 -0.1945 -0.1227 -0.0354 -0.0556 -0.0620 0.2203 -0.1552 -0.2432 -0.2643 -0.0101 -0.1047 -0.1013 -0.2358 0.0954 0.1090 0.0946 0.0870 0.0951 0.0183 0.1097 0.0780 0.1146 0.1146 0.1253 0.0777 0.0931 0.0842 0.0888 0.0795 0.0819 0.0754 0.0874 0.1488 0.1330 0.0686 0.0621 0.0800 0.0682 0.0872
va: 1.1486 1.9432 2.1285 2.9040 3.7419 3.8841 3.8538 3.9183 3.9104 3.8331 3.9484 3.8776 3.8641 4.1457 4.0281 3.9143 3.9334 3.9266 3.9669 3.8560 3.9255 1.0128 1.0026 1.0097 1.0028 1.0058 1.0631 0.9899 0.9980 1.0053 1.0047 1.0018 1.0098 1.0093 1.0038 1.0164 1.0064 1.0132 0.9977 1.0003 1.0026 1.0018 1.0185 1.0058 1.0071 1.0070 1.0095
dispcorr: -0.029926231 hartree
energy: -1328.998705372570
dipole: 8.91282 -9.47661 -0.56379 8.51352 -7.69797 0.81555 -9.12814 8.62115 -0.50699
magnitude: 1.11356 au
magnitude: 2.83045 debye
