program: Orca
programVersion: 5.0.2
elementType: Cl O O N C C C C C C C C C C C C C C C C C H H H H H H H H H H H H H H H H H H H H H H H H H H
charge: 0
multiplicity: 1
keywords: wb97x-d3
keywords: def2-TZVPP
keywords: def2/J RIJCOSX
keywords: DEFGRID2
keywords: scfconv7
keywords: smallprint printgap noloewdin
keywords: NOSOSCF
formula: C17H26ClNO2
InChI: InChI=1/C17H26ClNO2/c1-4-11-21-12-10-19(16(20)13-18)17-14(5-2)8-7-9-15(17)6-3/h7-9H,4-6,10-13H2,1-3H3
47 atoms
Cl -2.273348 -3.342122 1.164682
O  2.327672 -0.371252 -1.183137
O  0.489723 -2.484683 1.946751
N  0.276651 -0.434816 1.031673
C  -0.522856 0.593188 0.450021
C  -1.038943 0.426146 -0.84863
C  -0.768271 1.756287 1.186653
C  1.707974 -0.197913 1.18924
C  -0.851071 -0.870255 -1.596911
C  -0.296673 1.945221 2.606357
C  2.586335 -0.823384 0.115139
C  -1.76749 1.474117 -1.397717
C  -1.504067 2.778773 0.59311
C  -0.222528 -1.60486 1.522898
C  -1.992296 2.645026 -0.69037
C  -1.265167 -0.852491 -3.060455
C  0.745753 3.050927 2.760793
C  2.707972 0.952035 -1.460777
C  -1.738643 -1.712789 1.618385
C  2.362776 1.266797 -2.902436
C  3.050316 0.356783 -3.909695
H  1.861407 0.880359 1.224614
H  2.030662 -0.593756 2.154208
H  -1.414905 -1.663348 -1.095262
H  0.194283 -1.165802 -1.532479
H  -1.164208 2.195049 3.223469
H  0.095717 1.013286 3.013091
H  3.635068 -0.640562 0.396633
H  2.436433 -1.903224 0.109811
H  -2.173779 1.380156 -2.395197
H  -1.707254 3.682094 1.15633
H  -2.56375 3.446049 -1.140867
H  -2.332145 -0.670158 -3.192984
H  -1.047054 -1.818951 -3.512854
H  -0.719433 -0.097021 -3.628037
H  1.640592 2.848066 2.172041
H  1.050447 3.151366 3.802473
H  0.357169 4.016103 2.43614
H  2.192093 1.668444 -0.806649
H  3.788951 1.08102 -1.29277
H  -2.279986 -0.99437 1.010465
H  -2.017703 -1.54644 2.660331
H  1.277124 1.214034 -3.023189
H  2.638766 2.307805 -3.089149
H  2.793783 0.639344 -4.930666
H  2.760519 -0.683348 -3.769876
H  4.136429 0.413914 -3.816829
totalener: -1328.97083334 hartree
nucrepener: 1993.99260645 hartree
electener: -3322.96343979 hartree
oneelecener: -5778.96240828 hartree
twoeener: 2455.99896849 hartree
kineticenergy: 1324.30235577 hartree
xcener: -107.429918126534 hartree
chargesum: -0.0000000
charge: -0.117166 -0.332803 -0.376327 0.029234 -0.031674 -0.151726 -0.044615 -0.089313 -0.113157 -0.200939 -0.009277 -0.072851 -0.067732 0.257978 -0.154111 -0.292011 -0.232032 0.024007 -0.096851 -0.115300 -0.241946 0.088606 0.107432 0.087398 0.120726 0.095276 0.087224 0.077811 0.112501 0.122290 0.112501 0.125737 0.082421 0.097782 0.084722 0.077522 0.092295 0.079167 0.074020 0.078807 0.132129 0.128094 0.054137 0.067573 0.082871 0.091169 0.068400
qa: -0.1172 -0.3328 -0.3763 0.0292 -0.0317 -0.1517 -0.0446 -0.0893 -0.1132 -0.2009 -0.0093 -0.0729 -0.0677 0.2580 -0.1541 -0.2920 -0.2320 0.0240 -0.0969 -0.1153 -0.2419 0.0886 0.1074 0.0874 0.1207 0.0953 0.0872 0.0778 0.1125 0.1223 0.1125 0.1257 0.0824 0.0978 0.0847 0.0775 0.0923 0.0792 0.0740 0.0788 0.1321 0.1281 0.0541 0.0676 0.0829 0.0912 0.0684
va: 1.1494 1.9406 2.1423 2.9287 3.8540 3.8098 3.7508 3.8113 3.8577 3.8927 3.8973 3.8422 3.8913 4.1337 4.0689 3.9706 3.9205 3.9025 4.0403 3.9452 3.9306 0.9968 1.0316 1.0204 1.0137 0.9998 1.0117 1.0069 1.0141 1.0062 1.0057 1.0024 0.9987 1.0069 0.9994 1.0045 1.0077 1.0066 0.9848 0.9978 1.0016 1.0058 1.0149 1.0149 1.0058 1.0114 1.0062
dispcorr: -0.028260881 hartree
energy: -1328.999094220634
dipole: 17.73490 -17.62123 0.11367 22.78434 -20.73352 2.05083 -15.15179 15.03337 -0.11842
magnitude: 2.05738 au
magnitude: 5.22945 debye
