program: Orca
programVersion: 5.0.2
elementType: Cl O O N C C C C C C C C C C C C C C C C C H H H H H H H H H H H H H H H H H H H H H H H H H H
charge: 0
multiplicity: 1
keywords: wb97x-d3
keywords: def2-TZVPP
keywords: def2/J RIJCOSX
keywords: DEFGRID2
keywords: scfconv7
keywords: smallprint printgap noloewdin
keywords: NOSOSCF
formula: C17H26ClNO2
InChI: InChI=1/C17H26ClNO2/c1-4-11-21-12-10-19(16(20)13-18)17-14(5-2)8-7-9-15(17)6-3/h7-9H,4-6,10-13H2,1-3H3
47 atoms
Cl -3.126793 -1.912646 0.979372
O  2.635199 0.245548 -0.340479
O  -0.008425 -3.171079 1.455164
N  0.141998 -1.198247 0.369542
C  -0.361006 0.108623 0.109219
C  -1.178628 0.311053 -1.012037
C  0.008078 1.168631 0.946044
C  1.282467 -1.715224 -0.389265
C  -1.537741 -0.82753 -1.934943
C  0.896479 0.997262 2.151525
C  2.014386 -0.668998 -1.199023
C  -1.621633 1.601668 -1.279622
C  -0.46401 2.441678 0.642723
C  -0.437003 -2.055922 1.252975
C  -1.268226 2.65965 -0.460234
C  -2.921418 -0.729888 -2.564762
C  0.203073 1.334994 3.47027
C  2.884709 1.508373 -0.900667
C  -1.683577 -1.57334 1.978182
C  3.992038 1.525435 -1.944166
C  4.271636 2.94199 -2.426629
H  1.982312 -2.184231 0.30452
H  0.947228 -2.503877 -1.070427
H  -1.471615 -1.771548 -1.39618
H  -0.787015 -0.888358 -2.731567
H  1.301296 -0.011468 2.193637
H  1.762139 1.653047 2.033626
H  2.747921 -1.201614 -1.819976
H  1.332669 -0.159031 -1.893502
H  -2.252362 1.786994 -2.138634
H  -0.183508 3.275957 1.274765
H  -1.619796 3.658115 -0.685773
H  -3.143613 -1.640404 -3.120339
H  -3.007532 0.100163 -3.265667
H  -3.68875 -0.608533 -1.801079
H  -0.174614 2.356932 3.481694
H  0.897538 1.232644 4.30386
H  -0.641851 0.676711 3.669519
H  1.961166 1.925788 -1.330238
H  3.164777 2.157475 -0.066258
H  -1.690173 -0.509988 2.196512
H  -1.782763 -2.14129 2.899459
H  4.897334 1.088817 -1.514978
H  3.718063 0.899562 -2.798527
H  5.060939 2.957353 -3.177238
H  4.588518 3.587461 -1.605856
H  3.385085 3.393537 -2.874762
totalener: -1328.96868492 hartree
nucrepener: 2008.30514421 hartree
electener: -3337.27382913 hartree
oneelecener: -5807.64080964 hartree
twoeener: 2470.36698052 hartree
kineticenergy: 1324.30574152 hartree
xcener: -107.430183364637 hartree
chargesum: 0.0000000
charge: -0.131045 -0.323368 -0.377431 -0.004126 0.143460 -0.155668 -0.206012 -0.049606 -0.201055 -0.176699 -0.038860 -0.026590 -0.016866 0.256395 -0.185393 -0.251080 -0.223864 0.048522 -0.087639 -0.088068 -0.254448 0.112797 0.099355 0.099530 0.077585 0.089495 0.079338 0.094181 0.086421 0.117019 0.111952 0.124588 0.090619 0.075706 0.091382 0.074958 0.093463 0.070755 0.055517 0.073246 0.120142 0.149339 0.066724 0.055703 0.088773 0.075595 0.075258
qa: -0.1310 -0.3234 -0.3774 -0.0041 0.1435 -0.1557 -0.2060 -0.0496 -0.2011 -0.1767 -0.0389 -0.0266 -0.0169 0.2564 -0.1854 -0.2511 -0.2239 0.0485 -0.0876 -0.0881 -0.2544 0.1128 0.0994 0.0995 0.0776 0.0895 0.0793 0.0942 0.0864 0.1170 0.1120 0.1246 0.0906 0.0757 0.0914 0.0750 0.0935 0.0708 0.0555 0.0732 0.1201 0.1493 0.0667 0.0557 0.0888 0.0756 0.0753
va: 1.1508 1.9760 2.1396 2.9219 3.5660 3.7654 3.7877 3.8619 3.9028 3.8968 3.9841 3.8391 3.8061 4.1416 4.0722 3.9377 3.9166 3.9226 3.9684 3.8966 3.9485 1.0179 1.0083 1.0084 0.9971 1.0190 1.0063 0.9974 0.9798 1.0033 1.0044 1.0031 1.0068 1.0021 1.0142 1.0077 1.0063 1.0126 0.9928 0.9956 1.0203 1.0043 1.0131 1.0100 1.0059 1.0044 1.0037
dispcorr: -0.028878601 hartree
energy: -1328.997563517167
dipole: 20.49948 -20.01655 0.48293 19.00971 -17.40259 1.60711 -11.84563 11.10046 -0.74517
magnitude: 1.83611 au
magnitude: 4.66703 debye
