program: Orca
programVersion: 5.0.2
elementType: Cl O O N C C C C C C C C C C C C C C C C C H H H H H H H H H H H H H H H H H H H H H H H H H H
charge: 0
multiplicity: 1
keywords: wb97x-d3
keywords: def2-TZVPP
keywords: def2/J RIJCOSX
keywords: DEFGRID2
keywords: scfconv7
keywords: smallprint printgap noloewdin
keywords: NOSOSCF
formula: C17H26ClNO2
InChI: InChI=1/C17H26ClNO2/c1-4-11-21-12-10-19(16(20)13-18)17-14(5-2)8-7-9-15(17)6-3/h7-9H,4-6,10-13H2,1-3H3
47 atoms
Cl -2.964676 -2.139191 1.070052
O  2.747332 0.437095 -0.46966
O  0.166663 -2.924351 1.653553
N  0.278573 -1.030694 0.431377
C  -0.264025 0.240572 0.088077
C  -1.127541 0.346863 -1.01053
C  0.079075 1.35491 0.861221
C  1.459962 -1.56492 -0.247685
C  -1.452001 -0.848415 -1.87238
C  1.02185 1.279909 2.032835
C  2.151058 -0.604055 -1.189023
C  -1.663479 1.596618 -1.304389
C  -0.489578 2.581871 0.538318
C  -0.302028 -1.849024 1.351701
C  -1.355717 2.70363 -0.532535
C  -2.869141 -0.87184 -2.430253
C  0.315887 1.384151 3.383614
C  3.752353 1.133973 -1.161957
C  -1.613399 -1.389352 1.971803
C  3.276393 1.902865 -2.387196
C  2.152158 2.883129 -2.092856
H  2.178218 -1.902694 0.501883
H  1.173196 -2.450712 -0.823069
H  -1.293017 -1.763835 -1.304166
H  -0.738488 -0.887941 -2.703219
H  1.614011 0.36795 1.997255
H  1.737581 2.100219 1.943176
H  2.910239 -1.192661 -1.726629
H  1.453969 -0.228048 -1.949531
H  -2.335418 1.709191 -2.144622
H  -0.235731 3.45493 1.127993
H  -1.783924 3.667123 -0.776451
H  -3.051137 -1.813445 -2.947271
H  -3.053246 -0.073133 -3.148319
H  -3.602768 -0.784635 -1.629947
H  -0.292385 2.28643 3.454171
H  1.042796 1.410363 4.195444
H  -0.340004 0.533021 3.5676
H  4.177308 1.832202 -0.436721
H  4.558142 0.444018 -1.455817
H  -1.77692 -0.316557 1.958882
H  -1.66021 -1.759648 2.992996
H  4.143749 2.435481 -2.78824
H  2.970446 1.210017 -3.176847
H  1.883259 3.449831 -2.984348
H  2.44349 3.599363 -1.322564
H  1.253827 2.378148 -1.740038
totalener: -1328.96828677 hartree
nucrepener: 2027.88584736 hartree
electener: -3356.85413413 hartree
oneelecener: -5846.95103823 hartree
twoeener: 2490.09690410 hartree
kineticenergy: 1324.30381926 hartree
xcener: -107.429410742173 hartree
chargesum: 0.0000000
charge: -0.128879 -0.303115 -0.376974 -0.002256 0.096122 -0.139283 -0.132512 -0.064912 -0.202180 -0.180654 -0.014660 -0.020393 -0.040835 0.268550 -0.173998 -0.249938 -0.240893 -0.008291 -0.117090 -0.106818 -0.196350 0.108535 0.101830 0.096297 0.081369 0.085987 0.078154 0.090655 0.080489 0.113805 0.110497 0.122356 0.090476 0.075996 0.090108 0.080237 0.092527 0.073324 0.079685 0.075510 0.130706 0.149081 0.068896 0.061495 0.089495 0.069240 0.038605
qa: -0.1289 -0.3031 -0.3770 -0.0023 0.0961 -0.1393 -0.1325 -0.0649 -0.2022 -0.1807 -0.0147 -0.0204 -0.0408 0.2685 -0.1740 -0.2499 -0.2409 -0.0083 -0.1171 -0.1068 -0.1963 0.1085 0.1018 0.0963 0.0814 0.0860 0.0782 0.0907 0.0805 0.1138 0.1105 0.1224 0.0905 0.0760 0.0901 0.0802 0.0925 0.0733 0.0797 0.0755 0.1307 0.1491 0.0689 0.0615 0.0895 0.0692 0.0386
va: 1.1515 1.9714 2.1447 2.9123 3.6201 3.7943 3.7850 3.8759 3.8960 3.8990 3.9539 3.8127 3.7941 4.1050 4.0392 3.9349 3.9221 3.9456 3.9890 3.8520 3.9396 1.0184 1.0082 1.0106 0.9981 1.0216 1.0062 0.9991 0.9765 1.0054 1.0058 1.0041 1.0066 1.0029 1.0182 1.0047 1.0077 1.0087 0.9966 1.0032 1.0065 1.0017 1.0163 1.0056 1.0099 1.0083 1.0071
dispcorr: -0.030257085 hartree
energy: -1328.998543853877
dipole: 16.88502 -16.27763 0.60738 18.60570 -17.08685 1.51886 -12.29055 11.42505 -0.86550
magnitude: 1.85066 au
magnitude: 4.70399 debye
