program: Orca
programVersion: 5.0.2
elementType: Cl O O N C C C C C C C C C C C C C C C C C H H H H H H H H H H H H H H H H H H H H H H H H H H
charge: 0
multiplicity: 1
keywords: wb97x-d3
keywords: def2-TZVPP
keywords: def2/J RIJCOSX
keywords: DEFGRID2
keywords: scfconv7
keywords: smallprint printgap noloewdin
keywords: NOSOSCF
formula: C17H26ClNO2
InChI: InChI=1/C17H26ClNO2/c1-4-11-21-12-10-19(16(20)13-18)17-14(5-2)8-7-9-15(17)6-3/h7-9H,4-6,10-13H2,1-3H3
47 atoms
Cl -1.374875 -2.222052 3.398885
O  2.518054 0.063149 -0.62476
O  -0.012871 -3.191866 0.92646
N  -0.173469 -1.204477 -0.134908
C  -0.659497 0.133399 -0.208601
C  -1.592405 0.453145 -1.20421
C  -0.17513 1.111399 0.67266
C  0.800061 -1.624135 -1.134304
C  -2.1750 -0.575931 -2.139761
C  0.771891 0.817171 1.808057
C  2.244103 -1.299008 -0.781701
C  -2.007408 1.774189 -1.331232
C  -0.613578 2.420538 0.501505
C  -0.527767 -2.102679 0.828191
C  -1.514621 2.756447 -0.492645
C  -1.75334 -0.376791 -3.594851
C  0.200246 1.183113 3.176707
C  2.422617 0.842441 -1.789751
C  -1.683657 -1.698218 1.732539
C  3.035162 2.203726 -1.525783
C  4.508649 2.146176 -1.149349
H  0.71922 -2.702588 -1.269424
H  0.530466 -1.165026 -2.085885
H  -3.265206 -0.517882 -2.080229
H  -1.913738 -1.583826 -1.81771
H  1.064842 -0.230696 1.814382
H  1.696711 1.373381 1.641317
H  2.503276 -1.782847 0.161502
H  2.883054 -1.741651 -1.562008
H  -2.734701 2.031139 -2.092377
H  -0.239849 3.19265 1.163002
H  -1.840858 3.782049 -0.605187
H  -2.063584 0.597304 -3.972845
H  -2.200576 -1.137384 -4.234813
H  -0.671301 -0.438906 -3.713546
H  -0.03631 2.244543 3.25195
H  0.923021 0.953003 3.959242
H  -0.707578 0.625504 3.40426
H  2.950304 0.351934 -2.623633
H  1.376502 0.973104 -2.099953
H  -2.580475 -2.210151 1.379822
H  -1.889397 -0.632246 1.743337
H  2.902233 2.805227 -2.428724
H  2.46193 2.705062 -0.741215
H  4.662477 1.583873 -0.229662
H  4.915098 3.146529 -0.999802
H  5.09892 1.666614 -1.932593
totalener: -1328.96996728 hartree
nucrepener: 2005.34739776 hartree
electener: -3334.31736503 hartree
oneelecener: -5801.70036265 hartree
twoeener: 2467.38299762 hartree
kineticenergy: 1324.31210905 hartree
xcener: -107.430548473514 hartree
chargesum: -0.0000000
charge: -0.112572 -0.325149 -0.373680 0.016221 0.021709 -0.063611 -0.123412 -0.099111 -0.200662 -0.134020 -0.005725 -0.051512 -0.085957 0.239165 -0.154899 -0.234746 -0.239436 0.028965 -0.093672 -0.120752 -0.238341 0.110486 0.098825 0.093931 0.086275 0.076333 0.088596 0.105423 0.078713 0.113411 0.115619 0.126306 0.079463 0.094143 0.076330 0.074151 0.093043 0.073714 0.081446 0.066682 0.131789 0.124410 0.064473 0.059196 0.088463 0.083224 0.066752
qa: -0.1126 -0.3251 -0.3737 0.0162 0.0217 -0.0636 -0.1234 -0.0991 -0.2007 -0.1340 -0.0057 -0.0515 -0.0860 0.2392 -0.1549 -0.2347 -0.2394 0.0290 -0.0937 -0.1208 -0.2383 0.1105 0.0988 0.0939 0.0863 0.0763 0.0886 0.1054 0.0787 0.1134 0.1156 0.1263 0.0795 0.0941 0.0763 0.0742 0.0930 0.0737 0.0814 0.0667 0.1318 0.1244 0.0645 0.0592 0.0885 0.0832 0.0668
va: 1.1594 1.9470 2.1420 2.9204 3.7061 3.7682 3.7765 3.8045 3.8881 3.8739 3.9052 3.8688 3.8491 4.1530 4.0362 3.9197 3.9249 3.8999 4.0511 3.9448 3.9296 1.0413 0.9949 1.0003 1.0150 1.0222 1.0090 1.0070 1.0073 1.0049 1.0057 1.0013 1.0068 1.0081 1.0051 1.0091 1.0061 1.0221 0.9967 0.9864 1.0043 0.9977 1.0133 1.0124 1.0132 1.0065 1.0056
dispcorr: -0.029204776 hartree
energy: -1328.999172051869
dipole: 14.12424 -14.49686 -0.37262 18.44961 -17.09008 1.35953 -21.59048 20.09432 -1.49616
magnitude: 2.05564 au
magnitude: 5.22502 debye
