program: Orca
programVersion: 5.0.2
elementType: S S P O O O N C C C C C C C C C C C C C C H H H H H H H H H H H H H H H H H H H H H H H H H H H H
charge: 0
multiplicity: 1
keywords: wb97x-d3
keywords: def2-TZVPP
keywords: def2/J RIJCOSX
keywords: DEFGRID2
keywords: scfconv7
keywords: smallprint printgap noloewdin
keywords: NOSOSCF
formula: C14H28NO3PS2
InChI: InChI=1/C14H28NO3PS2/c1-4-10-17-19(20,18-11-5-2)21-12-14(16)15-9-7-6-8-13(15)3/h13H,4-12H2,1-3H3
49 atoms
S  0.005706 -1.690318 -0.012206
S  2.182779 -0.107554 -2.115792
P  1.510254 -0.277324 -0.31971
O  -1.427942 1.028458 -2.009642
O  0.875183 1.025067 0.352517
O  2.5429 -0.76607 0.800073
N  -2.615225 0.462459 -0.172394
C  -3.037809 -0.487944 0.860881
C  -4.566298 -0.556561 0.896765
C  -5.21179 0.814697 1.048868
C  -4.697321 1.761269 -0.026351
C  -3.177365 1.803999 -0.037313
C  -2.432894 -0.139087 2.216384
C  -1.759487 0.192282 -1.168974
C  -1.184597 -1.208939 -1.304859
C  1.005758 2.377457 -0.137904
C  3.769992 -1.460738 0.496997
C  2.040338 3.162728 0.634793
C  3.553791 -2.941924 0.286132
C  3.474139 2.692958 0.442794
C  2.970486 -3.657462 1.494313
H  -2.681237 -1.477897 0.587218
H  -4.916726 -1.022276 -0.028775
H  -4.864093 -1.218546 1.712536
H  -6.297711 0.722445 0.986957
H  -4.993078 1.228494 2.037383
H  -5.072291 2.773625 0.136211
H  -5.057013 1.442957 -1.009168
H  -2.808726 2.252833 0.889669
H  -2.818419 2.425589 -0.851267
H  -2.665245 -0.928501 2.931883
H  -2.81563 0.796023 2.625318
H  -1.348063 -0.058233 2.149839
H  -0.687384 -1.272458 -2.271547
H  -1.957252 -1.9789 -1.286105
H  0.018996 2.823065 -0.015151
H  1.241099 2.363737 -1.203964
H  4.23955 -1.005373 -0.376678
H  4.413011 -1.278242 1.35743
H  1.779331 3.171193 1.696352
H  1.946373 4.19681 0.291521
H  4.531607 -3.365093 0.043402
H  2.927692 -3.102674 -0.595918
H  3.647536 1.705186 0.87061
H  3.742225 2.652849 -0.614475
H  4.168177 3.376539 0.931957
H  1.974834 -3.290328 1.749361
H  3.606393 -3.528469 2.37273
H  2.881768 -4.7281 1.306069
elementType: S P O N C H
totalener: -1968.77407813 hartree
nucrepener: 2476.44785623 hartree
electener: -4445.22193435 hartree
oneelecener: -7633.46371219 hartree
twoeener: 3188.24177784 hartree
cpcmener: -0.03568614 hartree
kineticenergy: 1962.77672995 hartree
xcener: -137.080258542873 hartree
chargesum: -0.0000000
charge: -0.181203 -0.443716 0.664110 -0.560564 -0.351693 -0.377603 -0.035989 0.021033 -0.149373 -0.124302 -0.129985 -0.101943 -0.280740 0.247929 -0.080599 0.026407 0.026315 -0.082606 -0.117937 -0.273246 -0.250680 0.090116 0.081088 0.080405 0.078362 0.077452 0.077576 0.071879 0.113422 0.096666 0.100198 0.097072 0.079009 0.132392 0.156048 0.105480 0.102172 0.109847 0.115948 0.065211 0.070836 0.082722 0.062638 0.078140 0.079075 0.099742 0.073338 0.085401 0.094147
qa: -0.1812 -0.4437 0.6641 -0.5606 -0.3517 -0.3776 -0.0360 0.0210 -0.1494 -0.1243 -0.1300 -0.1019 -0.2807 0.2479 -0.0806 0.0264 0.0263 -0.0826 -0.1179 -0.2732 -0.2507 0.0901 0.0811 0.0804 0.0784 0.0775 0.0776 0.0719 0.1134 0.0967 0.1002 0.0971 0.0790 0.1324 0.1560 0.1055 0.1022 0.1098 0.1159 0.0652 0.0708 0.0827 0.0626 0.0781 0.0791 0.0997 0.0733 0.0854 0.0941
va: 2.2817 2.0019 5.4096 1.9217 2.0878 2.0736 3.1408 3.9537 3.9319 3.8790 3.9306 3.8595 3.9275 4.1127 3.8217 3.8267 3.7994 3.9228 3.8990 3.9214 3.9288 1.0090 1.0143 1.0131 1.0126 1.0058 1.0145 1.0127 0.9917 1.0435 1.0057 1.0007 1.0321 1.0410 0.9978 0.9960 1.0195 1.0171 0.9934 1.0122 1.0110 1.0155 1.0231 1.0093 1.0085 1.0076 1.0064 1.0018 1.0049
dispcorr: -0.028691481 hartree
energy: -1968.802769606383
dipole: -8.27952 7.05072 -1.22880 4.28637 -4.84589 -0.55952 16.40230 -14.10780 2.29450
magnitude: 2.66228 au
magnitude: 6.76698 debye
