program: Orca
programVersion: 5.0.2
elementType: S S P O O O N C C C C C C C C C C C C C C H H H H H H H H H H H H H H H H H H H H H H H H H H H H
charge: 0
multiplicity: 1
keywords: wb97x-d3
keywords: def2-TZVPP
keywords: def2/J RIJCOSX
keywords: DEFGRID2
keywords: scfconv7
keywords: smallprint printgap noloewdin
keywords: NOSOSCF
formula: C14H28NO3PS2
InChI: InChI=1/C14H28NO3PS2/c1-4-10-17-19(20,18-11-5-2)21-12-14(16)15-9-7-6-8-13(15)3/h13H,4-12H2,1-3H3
49 atoms
S  0.0197 -1.687513 -0.021702
S  2.194798 -0.092644 -2.113983
P  1.518733 -0.266391 -0.319889
O  -1.422808 1.040332 -2.006755
O  0.877231 1.032219 0.353385
O  2.552872 -0.747063 0.803378
N  -2.601826 0.462702 -0.16796
C  -3.027436 -0.497018 0.855466
C  -4.556212 -0.566361 0.884711
C  -5.202975 0.803206 1.046239
C  -4.685304 1.758994 -0.01925
C  -3.165299 1.802542 -0.0227
C  -2.427569 -0.160664 2.216172
C  -1.748906 0.199525 -1.168735
C  -1.170158 -1.199303 -1.313079
C  0.998821 2.385245 -0.138637
C  3.768161 -1.465423 0.50309
C  2.042031 3.17215 0.62018
C  3.527675 -2.944148 0.302255
C  3.475005 2.7120 0.400262
C  2.931315 -3.640357 1.515366
H  -2.669806 -1.484405 0.573895
H  -4.902817 -1.023776 -0.046431
H  -4.857086 -1.235642 1.693435
H  -6.288648 0.710791 0.980257
H  -4.987424 1.209018 2.03877
H  -5.062081 2.769789 0.149672
H  -5.040476 1.44793 -1.006094
H  -2.802031 2.241594 0.911054
H  -2.801902 2.432398 -0.828533
H  -2.813577 0.769414 2.633144
H  -1.342814 -0.077128 2.153424
H  -2.660632 -0.9578 2.922703
H  -0.670487 -1.25481 -2.278822
H  -1.940861 -1.971388 -1.301465
H  0.012534 2.827922 -0.002087
H  1.21937 2.371803 -1.207991
H  4.244402 -1.022412 -0.373412
H  4.414121 -1.288402 1.362694
H  1.799059 3.172351 1.686129
H  1.936342 4.207899 0.285034
H  4.499079 -3.385128 0.064391
H  2.900414 -3.101674 -0.579536
H  4.173497 3.394103 0.885283
H  3.660142 1.720396 0.814301
H  3.725581 2.684373 -0.661692
H  2.824382 -4.710571 1.335469
H  1.942121 -3.254607 1.767164
H  3.568508 -3.515294 2.39308
elementType: S P O N C H
totalener: -1968.77403456 hartree
nucrepener: 2477.95330497 hartree
electener: -4446.72733954 hartree
oneelecener: -7636.47535062 hartree
twoeener: 3189.74801108 hartree
cpcmener: -0.03567254 hartree
kineticenergy: 1962.77467563 hartree
xcener: -137.079891754274 hartree
chargesum: -0.0000000
charge: -0.181318 -0.443605 0.664062 -0.560306 -0.351828 -0.378006 -0.035315 0.020458 -0.149348 -0.124402 -0.129850 -0.102247 -0.280279 0.247220 -0.080365 0.027359 0.025732 -0.083212 -0.118283 -0.272636 -0.251225 0.090002 0.081046 0.080431 0.078377 0.077483 0.077639 0.071864 0.113585 0.096426 0.097007 0.079096 0.100193 0.132326 0.156185 0.105921 0.101762 0.110143 0.116093 0.065103 0.070995 0.083256 0.062826 0.099577 0.077448 0.079252 0.094307 0.073283 0.085766
qa: -0.1813 -0.4436 0.6641 -0.5603 -0.3518 -0.3780 -0.0353 0.0205 -0.1493 -0.1244 -0.1298 -0.1022 -0.2803 0.2472 -0.0804 0.0274 0.0257 -0.0832 -0.1183 -0.2726 -0.2512 0.0900 0.0810 0.0804 0.0784 0.0775 0.0776 0.0719 0.1136 0.0964 0.0970 0.0791 0.1002 0.1323 0.1562 0.1059 0.1018 0.1101 0.1161 0.0651 0.0710 0.0833 0.0628 0.0996 0.0774 0.0793 0.0943 0.0733 0.0858
va: 2.2816 2.0020 5.4090 1.9221 2.0878 2.0729 3.1390 3.9539 3.9322 3.8790 3.9303 3.8597 3.9274 4.1132 3.8214 3.8255 3.8000 3.9238 3.8963 3.9220 3.9283 1.0091 1.0143 1.0131 1.0126 1.0058 1.0145 1.0127 0.9915 1.0435 1.0007 1.0319 1.0057 1.0414 0.9976 0.9957 1.0197 1.0172 0.9934 1.0122 1.0109 1.0155 1.0232 1.0077 1.0095 1.0085 1.0049 1.0066 1.0018
dispcorr: -0.028726788 hartree
energy: -1968.802761351237
dipole: -8.45909 7.21673 -1.24236 4.16150 -4.75347 -0.59197 16.37502 -14.08509 2.28993
magnitude: 2.67164 au
magnitude: 6.79077 debye
