program: Orca
programVersion: 5.0.2
elementType: S S P O O O N C C C C C C C C C C C C C C H H H H H H H H H H H H H H H H H H H H H H H H H H H H
charge: 0
multiplicity: 1
keywords: wb97x-d3
keywords: def2-TZVPP
keywords: def2/J RIJCOSX
keywords: DEFGRID2
keywords: scfconv7
keywords: smallprint printgap noloewdin
keywords: NOSOSCF
formula: C14H28NO3PS2
InChI: InChI=1/C14H28NO3PS2/c1-4-10-17-19(20,18-11-5-2)21-12-14(16)15-9-7-6-8-13(15)3/h13H,4-12H2,1-3H3
49 atoms
S  -0.172336 1.525348 0.841046
S  2.067584 1.475544 -1.772213
P  1.302452 0.555706 -0.262803
O  -1.69408 0.448904 -2.280828
O  2.268632 0.225202 0.966239
O  0.573555 -0.830176 -0.602546
N  -2.866482 -0.040121 -0.409889
C  -3.297175 0.240884 0.964395
C  -2.922153 -0.933866 1.869729
C  -3.431294 -2.268283 1.341035
C  -2.972399 -2.472065 -0.096032
C  -3.373147 -1.291136 -0.966578
C  -4.780235 0.587806 1.021355
C  -2.00448 0.704711 -1.11743
C  -1.37753 1.925733 -0.467944
C  3.702122 0.394473 0.975536
C  1.003779 -1.684648 -1.682246
C  4.100612 1.481841 1.946063
C  2.297829 -2.40296 -1.370725
C  3.601324 2.866867 1.565709
C  2.245889 -3.251038 -0.110118
H  -2.760624 1.113416 1.326829
H  -1.832214 -0.97013 1.955321
H  -3.310843 -0.739138 2.87153
H  -3.07179 -3.080105 1.976058
H  -4.523908 -2.302349 1.384942
H  -3.40448 -3.381349 -0.518436
H  -1.884655 -2.589947 -0.128838
H  -4.462192 -1.234098 -1.043124
H  -2.994433 -1.411075 -1.976663
H  -5.002085 1.448172 0.38935
H  -5.05003 0.850871 2.044424
H  -5.42645 -0.23362 0.712995
H  -2.110988 2.580832 0.003677
H  -0.875499 2.505764 -1.240464
H  4.058136 0.622237 -0.031268
H  4.118458 -0.568399 1.271763
H  0.186165 -2.393212 -1.815076
H  1.093848 -1.095112 -2.596724
H  5.193092 1.4789 1.979979
H  3.76328 1.218945 2.951716
H  3.121003 -1.68413 -1.315798
H  2.514499 -3.037169 -2.234261
H  3.928014 3.146903 0.563418
H  2.512557 2.931918 1.589837
H  3.981964 3.616044 2.260086
H  2.089933 -2.649517 0.785393
H  3.178876 -3.797895 0.025585
H  1.438977 -3.984325 -0.160951
elementType: S P O N C H
totalener: -1968.77459913 hartree
nucrepener: 2498.97919490 hartree
electener: -4467.75379402 hartree
oneelecener: -7678.62120565 hartree
twoeener: 3210.86741163 hartree
cpcmener: -0.03738977 hartree
kineticenergy: 1962.78879935 hartree
xcener: -137.081713637617 hartree
chargesum: -0.0000000
charge: -0.160683 -0.443510 0.645508 -0.562454 -0.368182 -0.353614 -0.043899 0.005636 -0.129474 -0.114207 -0.122816 -0.108609 -0.291724 0.248404 -0.087516 0.031436 0.001040 -0.077392 -0.094614 -0.268831 -0.267560 0.092840 0.068581 0.082390 0.079045 0.077369 0.080081 0.062751 0.114596 0.099504 0.098260 0.096385 0.092786 0.158772 0.130636 0.099621 0.111255 0.113044 0.113865 0.068356 0.065926 0.062992 0.085433 0.080371 0.069672 0.098682 0.076351 0.096706 0.086788
qa: -0.1607 -0.4435 0.6455 -0.5625 -0.3682 -0.3536 -0.0439 0.0056 -0.1295 -0.1142 -0.1228 -0.1086 -0.2917 0.2484 -0.0875 0.0314 0.0010 -0.0774 -0.0946 -0.2688 -0.2676 0.0928 0.0686 0.0824 0.0790 0.0774 0.0801 0.0628 0.1146 0.0995 0.0983 0.0964 0.0928 0.1588 0.1306 0.0996 0.1113 0.1130 0.1139 0.0684 0.0659 0.0630 0.0854 0.0804 0.0697 0.0987 0.0764 0.0967 0.0868
va: 2.2851 1.9999 5.4217 1.9225 2.0744 2.0638 3.1397 3.9651 3.8957 3.8731 3.9127 3.8624 3.9580 4.1345 3.8097 3.8196 3.8172 3.9048 3.8788 3.9164 3.9259 1.0072 1.0311 1.0149 1.0118 1.0069 1.0159 1.0169 0.9969 1.0426 1.0081 1.0044 1.0007 0.9993 1.0424 1.0158 0.9962 0.9905 1.0256 1.0132 1.0131 1.0178 1.0148 1.0093 1.0185 1.0084 1.0123 1.0040 1.0035
dispcorr: -0.029466157 hartree
energy: -1968.804065286751
dipole: -5.48710 4.74545 -0.74165 -15.05452 13.85339 -1.20113 11.78409 -9.48430 2.29979
magnitude: 2.69848 au
magnitude: 6.85899 debye
