program: Orca
programVersion: 5.0.2
elementType: S S P O O O N C C C C C C C C C C C C C C H H H H H H H H H H H H H H H H H H H H H H H H H H H H
charge: 0
multiplicity: 1
keywords: wb97x-d3
keywords: def2-TZVPP
keywords: def2/J RIJCOSX
keywords: DEFGRID2
keywords: scfconv7
keywords: smallprint printgap noloewdin
keywords: NOSOSCF
formula: C14H28NO3PS2
InChI: InChI=1/C14H28NO3PS2/c1-4-10-17-19(20,18-11-5-2)21-12-14(16)15-9-7-6-8-13(15)3/h13H,4-12H2,1-3H3
49 atoms
S  -0.03566 1.712312 0.318861
S  2.178056 0.737245 -2.099594
P  1.439862 0.399609 -0.353477
O  -1.491085 -0.385252 -2.270526
O  2.462385 0.441569 0.878021
O  0.719412 -1.009766 -0.127153
N  -2.691935 -0.211321 -0.362091
C  -3.220711 0.564578 0.765243
C  -2.991536 -0.191506 2.073841
C  -3.51142 -1.621469 2.024697
C  -2.91228 -2.348595 0.829861
C  -3.179463 -1.584775 -0.457337
C  -4.681771 0.933811 0.536778
C  -1.825677 0.254618 -1.273519
C  -1.212711 1.631294 -1.075505
C  3.651254 1.261827 0.890526
C  1.04604 -2.183752 -0.89909
C  3.357472 2.705974 1.226406
C  2.368441 -2.799488 -0.495501
C  2.71252 2.901742 2.589594
C  2.596037 -4.099401 -1.25317
H  -2.666182 1.496383 0.834468
H  -1.918036 -0.205261 2.283198
H  -3.462846 0.368157 2.884531
H  -3.26472 -2.138721 2.95354
H  -4.602764 -1.627783 1.947862
H  -3.33091 -3.35202 0.732092
H  -1.832221 -2.464442 0.964648
H  -4.252502 -1.574165 -0.668017
H  -2.700711 -2.074679 -1.299555
H  -4.796286 1.503752 -0.386132
H  -5.033621 1.557908 1.358497
H  -5.338237 0.065438 0.479165
H  -1.952356 2.407925 -0.87725
H  -0.688614 1.9080 -1.988961
H  4.158479 1.176428 -0.072016
H  4.288867 0.809944 1.64935
H  0.220773 -2.872098 -0.712826
H  1.042819 -1.932672 -1.962143
H  2.743184 3.155159 0.441387
H  4.31544 3.230041 1.193236
H  2.375692 -2.986388 0.580829
H  3.183744 -2.103069 -0.708734
H  1.736414 2.419938 2.65949
H  3.339536 2.491716 3.383825
H  2.564623 3.961079 2.800228
H  2.59933 -3.936463 -2.332915
H  1.817391 -4.83085 -1.030162
H  3.554167 -4.545155 -0.985355
elementType: S P O N C H
totalener: -1968.77504700 hartree
nucrepener: 2482.86725870 hartree
electener: -4451.64230570 hartree
oneelecener: -7646.38973414 hartree
twoeener: 3194.74742844 hartree
cpcmener: -0.03668131 hartree
kineticenergy: 1962.77336887 hartree
xcener: -137.077479571641 hartree
chargesum: 0.0000000
charge: -0.179162 -0.446061 0.643219 -0.558399 -0.370153 -0.352166 -0.036140 -0.007916 -0.121143 -0.113926 -0.132302 -0.110743 -0.290050 0.249161 -0.070543 0.028310 0.021460 -0.125176 -0.074073 -0.250521 -0.274447 0.091948 0.068788 0.081547 0.079387 0.077200 0.081363 0.067350 0.116381 0.098982 0.097639 0.096831 0.092240 0.157783 0.131520 0.109764 0.113933 0.110446 0.099995 0.065273 0.084270 0.070781 0.056689 0.072480 0.087064 0.094722 0.084748 0.086242 0.095402
qa: -0.1792 -0.4461 0.6432 -0.5584 -0.3702 -0.3522 -0.0361 -0.0079 -0.1211 -0.1139 -0.1323 -0.1107 -0.2900 0.2492 -0.0705 0.0283 0.0215 -0.1252 -0.0741 -0.2505 -0.2744 0.0919 0.0688 0.0815 0.0794 0.0772 0.0814 0.0674 0.1164 0.0990 0.0976 0.0968 0.0922 0.1578 0.1315 0.1098 0.1139 0.1104 0.1000 0.0653 0.0843 0.0708 0.0567 0.0725 0.0871 0.0947 0.0847 0.0862 0.0954
va: 2.2775 1.9975 5.4171 1.9270 2.0829 2.0885 3.1290 3.9822 3.8906 3.8721 3.9112 3.8614 3.9574 4.1257 3.8172 3.8149 3.8074 3.8736 3.8864 3.9246 3.9515 1.0091 1.0294 1.0148 1.0119 1.0070 1.0154 1.0170 0.9974 1.0403 1.0075 1.0047 1.0014 0.9988 1.0434 1.0198 0.9953 0.9878 1.0194 1.0225 1.0168 1.0134 1.0279 1.0079 1.0019 1.0047 1.0010 1.0013 1.0030
dispcorr: -0.028163071 hartree
energy: -1968.803210066917
dipole: -8.81647 7.73745 -1.07903 -10.45458 10.59105 0.13647 14.83610 -12.33442 2.50169
magnitude: 2.72789 au
magnitude: 6.93374 debye
