program: Orca
programVersion: 5.0.2
elementType: S S P O O O N C C C C C C C C C C C C C C H H H H H H H H H H H H H H H H H H H H H H H H H H H H
charge: 0
multiplicity: 1
keywords: wb97x-d3
keywords: def2-TZVPP
keywords: def2/J RIJCOSX
keywords: DEFGRID2
keywords: scfconv7
keywords: smallprint printgap noloewdin
keywords: NOSOSCF
formula: C14H28NO3PS2
InChI: InChI=1/C14H28NO3PS2/c1-4-10-17-19(20,18-11-5-2)21-12-14(16)15-9-7-6-8-13(15)3/h13H,4-12H2,1-3H3
49 atoms
S  -0.078419 1.446831 0.805963
S  2.046717 1.277905 -1.885424
P  1.34107 0.409683 -0.317961
O  -1.697867 0.347357 -2.249852
O  2.386298 0.056114 0.839816
O  0.608028 -0.992002 -0.541307
N  -2.808731 -0.08923 -0.329872
C  -3.262268 0.278119 1.015552
C  -2.960977 -0.857832 1.993638
C  -3.503885 -2.199106 1.519689
C  -3.007317 -2.495021 0.111868
C  -3.334648 -1.352899 -0.837205
C  -4.731977 0.683704 1.005349
C  -1.971053 0.636269 -1.085112
C  -1.302193 1.85882 -0.481344
C  3.600643 0.794139 1.068576
C  0.877621 -1.848254 -1.671367
C  3.360908 2.125586 1.746177
C  2.209071 -2.55861 -1.568433
C  4.6850 2.812972 2.043083
C  2.361752 -3.430366 -0.332114
H  -2.699258 1.146136 1.348451
H  -1.876562 -0.929287 2.11793
H  -3.373981 -0.594076 2.969583
H  -3.19308 -2.988037 2.20702
H  -4.597742 -2.192076 1.530745
H  -3.457077 -3.410727 -0.27657
H  -1.923969 -2.651089 0.123583
H  -4.4172 -1.269104 -0.967644
H  -2.91451 -1.542944 -1.81996
H  -4.896659 1.519418 0.324408
H  -5.028814 1.005334 2.003851
H  -5.397507 -0.127454 0.710435
H  -2.00638 2.544542 -0.008874
H  -0.803007 2.407522 -1.278451
H  4.127974 0.928884 0.121195
H  4.205141 0.143871 1.699956
H  0.051764 -2.560386 -1.673866
H  0.820575 -1.262438 -2.590314
H  2.801469 1.971427 2.671821
H  2.751253 2.767793 1.105554
H  3.022938 -1.830631 -1.624551
H  2.295608 -3.175154 -2.466885
H  4.523513 3.771675 2.534493
H  5.310747 2.206604 2.699764
H  5.248737 3.002132 1.128347
H  1.57335 -4.183314 -0.278211
H  2.330666 -2.84771 0.588473
H  3.316663 -3.956295 -0.349892
elementType: S P O N C H
totalener: -1968.77520300 hartree
nucrepener: 2481.19602628 hartree
electener: -4449.97122928 hartree
oneelecener: -7642.99264955 hartree
twoeener: 3193.02142027 hartree
cpcmener: -0.03634371 hartree
kineticenergy: 1962.79233578 hartree
xcener: -137.081449698773 hartree
chargesum: -0.0000000
charge: -0.162109 -0.446426 0.644286 -0.559122 -0.364435 -0.356091 -0.040512 0.001101 -0.124994 -0.112537 -0.128366 -0.111232 -0.292909 0.250729 -0.081882 0.038323 0.007152 -0.087903 -0.092546 -0.273749 -0.255679 0.091425 0.069085 0.081554 0.078102 0.077330 0.080011 0.065920 0.115292 0.100291 0.098285 0.096479 0.092243 0.158341 0.129660 0.096502 0.111553 0.113723 0.111048 0.071894 0.054685 0.058920 0.080601 0.094691 0.085758 0.084947 0.082042 0.074661 0.093860
qa: -0.1621 -0.4464 0.6443 -0.5591 -0.3644 -0.3561 -0.0405 0.0011 -0.1250 -0.1125 -0.1284 -0.1112 -0.2929 0.2507 -0.0819 0.0383 0.0072 -0.0879 -0.0925 -0.2737 -0.2557 0.0914 0.0691 0.0816 0.0781 0.0773 0.0800 0.0659 0.1153 0.1003 0.0983 0.0965 0.0922 0.1583 0.1297 0.0965 0.1116 0.1137 0.1110 0.0719 0.0547 0.0589 0.0806 0.0947 0.0858 0.0849 0.0820 0.0747 0.0939
va: 2.2794 1.9959 5.4117 1.9264 2.1026 2.0683 3.1294 3.9735 3.8907 3.8721 3.9115 3.8619 3.9580 4.1231 3.8170 3.8243 3.8113 3.8544 3.8923 3.9648 3.9303 1.0079 1.0301 1.0149 1.0122 1.0068 1.0157 1.0165 0.9973 1.0406 1.0076 1.0045 1.0009 0.9985 1.0437 1.0139 0.9950 0.9893 1.0244 1.0091 1.0272 1.0266 1.0132 1.0019 1.0017 1.0014 1.0025 1.0145 1.0045
dispcorr: -0.028337222 hartree
energy: -1968.803540217758
dipole: -5.05151 4.06854 -0.98297 -12.56363 11.91167 -0.65196 13.01042 -10.56413 2.44630
magnitude: 2.71581 au
magnitude: 6.90305 debye
