program: Orca
programVersion: 5.0.2
elementType: S S P O O O N C C C C C C C C C C C C C C H H H H H H H H H H H H H H H H H H H H H H H H H H H H
charge: 0
multiplicity: 1
keywords: wb97x-d3
keywords: def2-TZVPP
keywords: def2/J RIJCOSX
keywords: DEFGRID2
keywords: scfconv7
keywords: smallprint printgap noloewdin
keywords: NOSOSCF
formula: C14H28NO3PS2
InChI: InChI=1/C14H28NO3PS2/c1-4-10-17-19(20,18-11-5-2)21-12-14(16)15-9-7-6-8-13(15)3/h13H,4-12H2,1-3H3
49 atoms
S  -0.253888 -1.91319 -0.445414
S  1.714896 -1.131034 -2.922816
P  1.195485 -0.599873 -1.14671
O  -0.023707 0.697977 2.113614
O  0.491945 0.820199 -0.987005
O  2.360756 -0.485885 -0.055118
N  -2.068765 0.435438 1.185882
C  -3.131471 -0.397742 0.611965
C  -3.572935 0.182425 -0.731603
C  -3.963241 1.650294 -0.632848
C  -2.824835 2.446806 -0.013113
C  -2.395965 1.852735 1.320121
C  -4.28138 -0.576214 1.596662
C  -0.864766 -0.013966 1.563103
C  -0.503913 -1.466678 1.311452
C  0.967157 2.006084 -1.668938
C  3.417194 -1.462461 0.069155
C  1.117185 3.144466 -0.687908
C  3.187468 -2.375971 1.2517
C  2.230536 2.954026 0.329345
C  3.174739 -1.657427 2.592603
H  -2.729074 -1.386857 0.412912
H  -2.747383 0.074506 -1.4416
H  -4.400635 -0.418471 -1.113839
H  -4.20395 2.039294 -1.623837
H  -4.866602 1.7633 -0.026786
H  -3.116889 3.486212 0.149213
H  -1.970081 2.459792 -0.695388
H  -3.197611 1.96746 2.05519
H  -1.532471 2.381129 1.71304
H  -4.785132 0.358585 1.841828
H  -3.927468 -1.022424 2.526664
H  -5.02619 -1.247993 1.169216
H  -1.272996 -2.158353 1.659971
H  0.400357 -1.695098 1.869251
H  0.228281 2.243803 -2.434109
H  1.915993 1.803724 -2.171437
H  3.506125 -2.033236 -0.857839
H  4.335193 -0.887676 0.194256
H  0.164284 3.323996 -0.182713
H  1.315977 4.036593 -1.287346
H  3.995967 -3.111188 1.237387
H  2.264183 -2.943001 1.105483
H  2.353884 3.853292 0.932951
H  2.026314 2.133072 1.014305
H  3.184918 2.753898 -0.160593
H  2.994028 -2.359709 3.406285
H  2.398864 -0.892738 2.645389
H  4.131667 -1.169146 2.784804
elementType: S P O N C H
totalener: -1968.77543544 hartree
nucrepener: 2527.49136914 hartree
electener: -4496.26680458 hartree
oneelecener: -7735.51028553 hartree
twoeener: 3239.24348096 hartree
cpcmener: -0.03817076 hartree
kineticenergy: 1962.77609384 hartree
xcener: -137.078877977092 hartree
chargesum: 0.0000000
charge: -0.159193 -0.454222 0.615154 -0.566992 -0.327156 -0.331673 -0.025824 -0.009537 -0.123719 -0.111708 -0.132656 -0.118683 -0.290166 0.252415 -0.114855 -0.003268 0.029505 -0.106411 -0.116450 -0.268026 -0.256128 0.096164 0.068066 0.083269 0.078145 0.078561 0.084106 0.061876 0.119144 0.102772 0.092879 0.097793 0.096968 0.159301 0.160322 0.124081 0.110039 0.101182 0.108367 0.067996 0.083419 0.084211 0.059399 0.098460 0.064707 0.088502 0.097562 0.060479 0.091822
qa: -0.1592 -0.4542 0.6152 -0.5670 -0.3272 -0.3317 -0.0258 -0.0095 -0.1237 -0.1117 -0.1327 -0.1187 -0.2902 0.2524 -0.1149 -0.0033 0.0295 -0.1064 -0.1164 -0.2680 -0.2561 0.0962 0.0681 0.0833 0.0781 0.0786 0.0841 0.0619 0.1191 0.1028 0.0929 0.0978 0.0970 0.1593 0.1603 0.1241 0.1100 0.1012 0.1084 0.0680 0.0834 0.0842 0.0594 0.0985 0.0647 0.0885 0.0976 0.0605 0.0918
va: 2.2803 2.0169 5.4492 1.9054 2.0767 2.0796 3.1624 3.9796 3.8950 3.8779 3.9089 3.8637 3.9550 4.1482 3.8564 3.8376 3.8341 3.9065 3.8958 3.9282 3.8940 1.0098 1.0283 1.0146 1.0118 1.0069 1.0158 1.0210 0.9980 1.0352 1.0010 1.0081 1.0045 1.0027 0.9980 0.9975 1.0118 1.0234 0.9951 1.0102 1.0137 1.0160 1.0157 1.0058 1.0204 1.0021 1.0041 1.0294 1.0031
dispcorr: -0.031332539 hartree
energy: -1968.806767976244
dipole: -9.26273 7.60627 -1.65646 13.49902 -13.44139 0.05763 15.81045 -14.97951 0.83094
magnitude: 1.85409 au
magnitude: 4.71272 debye
