program: Orca
programVersion: 5.0.2
elementType: S S P O O O N C C C C C C C C C C C C C C H H H H H H H H H H H H H H H H H H H H H H H H H H H H
charge: 0
multiplicity: 1
keywords: wb97x-d3
keywords: def2-TZVPP
keywords: def2/J RIJCOSX
keywords: DEFGRID2
keywords: scfconv7
keywords: smallprint printgap noloewdin
keywords: NOSOSCF
formula: C14H28NO3PS2
InChI: InChI=1/C14H28NO3PS2/c1-4-10-17-19(20,18-11-5-2)21-12-14(16)15-9-7-6-8-13(15)3/h13H,4-12H2,1-3H3
49 atoms
S  0.197777 -1.455401 0.007281
S  2.186524 -0.776304 -2.677345
P  1.838189 -0.441118 -0.818237
O  -1.221374 1.152115 -1.945381
O  1.632577 1.113337 -0.528255
O  2.961482 -0.849411 0.244997
N  -2.466323 0.646981 -0.124266
C  -2.91609 -0.272899 0.927641
C  -4.444749 -0.267564 0.991219
C  -5.015877 1.134945 1.151677
C  -4.482131 2.045103 0.055054
C  -2.962711 2.015015 0.006041
C  -2.277579 0.055403 2.273344
C  -1.613057 0.334336 -1.112569
C  -1.096519 -1.087549 -1.220535
C  1.408343 1.649105 0.79296
C  3.871026 -1.955273 0.057024
C  0.796688 3.024843 0.660529
C  3.25233 -3.286508 0.419199
C  0.436652 3.580712 2.029572
C  2.766401 -3.367676 1.857421
H  -2.613848 -1.282372 0.659749
H  -4.835441 -0.716745 0.073759
H  -4.758739 -0.912335 1.814599
H  -6.106293 1.098361 1.119635
H  -4.74882 1.542465 2.130841
H  -4.803178 3.076309 0.214729
H  -4.880962 1.73436 -0.914875
H  -2.549801 2.460343 0.916532
H  -2.597662 2.607082 -0.827033
H  -2.581368 1.02665 2.663021
H  -1.189859 0.043283 2.205648
H  -2.57167 -0.697454 3.005213
H  -0.67977 -1.229218 -2.217294
H  -1.864398 -1.847339 -1.08146
H  2.362162 1.695149 1.322187
H  0.743685 0.989257 1.356593
H  4.228122 -1.95616 -0.974612
H  4.716167 -1.731472 0.707352
H  -0.098779 2.970241 0.03809
H  1.498049 3.693516 0.156189
H  4.026327 -4.039022 0.248609
H  2.442685 -3.525286 -0.275181
H  -0.300992 2.950978 2.530733
H  1.311303 3.648234 2.678344
H  0.013314 4.580839 1.943509
H  3.580583 -3.176939 2.558656
H  2.36701 -4.357986 2.075765
H  1.975023 -2.647885 2.06872
elementType: S P O N C H
totalener: -1968.77639420 hartree
nucrepener: 2470.32115495 hartree
electener: -4439.09754915 hartree
oneelecener: -7620.53632231 hartree
twoeener: 3181.43877316 hartree
cpcmener: -0.04487176 hartree
kineticenergy: 1962.78135573 hartree
xcener: -137.080477371865 hartree
chargesum: -0.0000000
charge: -0.187375 -0.436114 0.626201 -0.563786 -0.343984 -0.348616 -0.039291 0.031827 -0.155123 -0.123344 -0.133254 -0.103394 -0.300742 0.253347 -0.074671 0.003177 0.010582 -0.096449 -0.115462 -0.285922 -0.251080 0.093038 0.080894 0.081425 0.078594 0.077759 0.077503 0.073568 0.106642 0.103329 0.097593 0.093878 0.106502 0.133745 0.156748 0.131165 0.096735 0.109780 0.111249 0.061602 0.086864 0.084090 0.064505 0.079734 0.093557 0.098091 0.087622 0.094374 0.072888
qa: -0.1874 -0.4361 0.6262 -0.5638 -0.3440 -0.3486 -0.0393 0.0318 -0.1551 -0.1233 -0.1333 -0.1034 -0.3007 0.2533 -0.0747 0.0032 0.0106 -0.0964 -0.1155 -0.2859 -0.2511 0.0930 0.0809 0.0814 0.0786 0.0778 0.0775 0.0736 0.1066 0.1033 0.0976 0.0939 0.1065 0.1337 0.1567 0.1312 0.0967 0.1098 0.1112 0.0616 0.0869 0.0841 0.0645 0.0797 0.0936 0.0981 0.0876 0.0944 0.0729
va: 2.2720 2.0351 5.4487 1.9167 2.1148 2.0834 3.1425 3.9381 3.9419 3.8769 3.9415 3.8712 3.9365 4.1242 3.8090 3.8151 3.8427 3.8819 3.8489 3.9551 3.9193 1.0022 1.0148 1.0129 1.0125 1.0061 1.0143 1.0130 0.9907 1.0380 0.9977 1.0077 1.0096 1.0470 0.9981 1.0051 1.0016 1.0179 0.9943 1.0200 1.0120 1.0180 1.0227 0.9977 1.0025 1.0029 1.0017 1.0045 1.0082
dispcorr: -0.028938328 hartree
energy: -1968.805332532356
dipole: -17.57084 15.89626 -1.67459 6.40975 -7.40840 -0.99866 26.44212 -22.72490 3.71722
magnitude: 4.19753 au
magnitude: 10.66928 debye
