program: Orca
programVersion: 5.0.2
elementType: S S P O O O N C C C C C C C C C C C C C C H H H H H H H H H H H H H H H H H H H H H H H H H H H H
charge: 0
multiplicity: 1
keywords: wb97x-d3
keywords: def2-TZVPP
keywords: def2/J RIJCOSX
keywords: DEFGRID2
keywords: scfconv7
keywords: smallprint printgap noloewdin
keywords: NOSOSCF
formula: C14H28NO3PS2
InChI: InChI=1/C14H28NO3PS2/c1-4-10-17-19(20,18-11-5-2)21-12-14(16)15-9-7-6-8-13(15)3/h13H,4-12H2,1-3H3
49 atoms
S  -0.570901 -1.883118 -0.202423
S  1.913899 -1.335958 -2.205209
P  1.137556 -0.756151 -0.540549
O  -0.633374 0.721341 2.38742
O  0.603549 0.742748 -0.43296
O  2.04381 -0.864701 0.772385
N  -2.483975 0.562111 1.09782
C  -3.458868 -0.208458 0.317357
C  -3.532141 0.346631 -1.105193
C  -3.795703 1.845945 -1.132356
C  -2.763455 2.572594 -0.281761
C  -2.721537 2.002499 1.127845
C  -4.815142 -0.248686 1.012315
C  -1.391246 0.052515 1.684522
C  -1.068668 -1.419071 1.495934
C  1.419462 1.877592 -0.055768
C  2.957797 -1.965909 0.971104
C  2.482668 2.214351 -1.076496
C  4.373971 -1.567416 0.625961
C  1.934355 2.505587 -2.463612
C  4.898257 -0.391709 1.435841
H  -3.11461 -1.236524 0.247621
H  -2.582595 0.136861 -1.606427
H  -4.306051 -0.195797 -1.652328
H  -3.768236 2.209029 -2.161336
H  -4.799535 2.061489 -0.75481
H  -2.988919 3.639064 -0.22123
H  -1.773024 2.481425 -0.738234
H  -3.6672 2.200241 1.639453
H  -1.942044 2.479524 1.713891
H  -4.726675 -0.674224 2.012404
H  -5.494428 -0.882617 0.44197
H  -5.281007 0.732191 1.103073
H  -1.916829 -2.06628 1.725613
H  -0.269328 -1.684725 2.18386
H  1.858957 1.700896 0.926421
H  0.705484 2.695663 0.039842
H  2.869695 -2.230605 2.024843
H  2.642306 -2.831375 0.383952
H  3.230869 1.417821 -1.119083
H  3.002751 3.094597 -0.689686
H  4.44357 -1.35613 -0.443081
H  4.996117 -2.447608 0.80672
H  1.16879 3.283178 -2.430736
H  2.726162 2.852138 -3.127942
H  1.493844 1.618686 -2.919147
H  4.342851 0.525232 1.234457
H  5.942992 -0.194827 1.195027
H  4.838807 -0.58877 2.507648
elementType: S P O N C H
totalener: -1968.77421909 hartree
nucrepener: 2504.73753605 hartree
electener: -4473.51175513 hartree
oneelecener: -7689.84651447 hartree
twoeener: 3216.33475934 hartree
cpcmener: -0.03597455 hartree
kineticenergy: 1962.77849625 hartree
xcener: -137.080380086229 hartree
chargesum: 0.0000000
charge: -0.167533 -0.453741 0.646229 -0.566067 -0.346594 -0.345770 -0.037856 0.000706 -0.127357 -0.113052 -0.124772 -0.109453 -0.290334 0.240860 -0.088748 -0.002601 0.026012 -0.096048 -0.105969 -0.259029 -0.246197 0.092942 0.066605 0.082612 0.078130 0.077990 0.081894 0.061254 0.115516 0.099540 0.097959 0.096776 0.092579 0.158573 0.135980 0.120580 0.116638 0.114459 0.100370 0.054466 0.084062 0.061656 0.077317 0.084467 0.096495 0.070902 0.068794 0.093349 0.085410
qa: -0.1675 -0.4537 0.6462 -0.5661 -0.3466 -0.3458 -0.0379 0.0007 -0.1274 -0.1131 -0.1248 -0.1095 -0.2903 0.2409 -0.0887 -0.0026 0.0260 -0.0960 -0.1060 -0.2590 -0.2462 0.0929 0.0666 0.0826 0.0781 0.0780 0.0819 0.0613 0.1155 0.0995 0.0980 0.0968 0.0926 0.1586 0.1360 0.1206 0.1166 0.1145 0.1004 0.0545 0.0841 0.0617 0.0773 0.0845 0.0965 0.0709 0.0688 0.0933 0.0854
va: 2.2939 2.0041 5.4245 1.9167 2.0609 2.0660 3.1387 3.9719 3.8966 3.8734 3.9109 3.8621 3.9554 4.1625 3.8199 3.8264 3.8254 3.8996 3.9123 3.9191 3.9237 1.0080 1.0312 1.0149 1.0119 1.0068 1.0154 1.0179 0.9975 1.0418 1.0085 1.0041 1.0010 0.9986 1.0293 1.0089 0.9871 0.9968 1.0175 1.0203 1.0149 1.0238 1.0147 1.0044 1.0041 1.0223 1.0070 1.0056 1.0023
dispcorr: -0.030094872 hartree
energy: -1968.804313958422
dipole: -3.79909 2.45019 -1.34890 16.54244 -16.39680 0.14564 2.91383 -2.05760 0.85624
magnitude: 1.60433 au
magnitude: 4.07789 debye
