program: Gaussian 09
title: 000056154
version: EM64L-G09RevD.01
frameworkgroup: C1[X(C10H12N2O2)]
method: RPBEPBE
basis: SDD
operation: Freq
keyword: #p
keyword: freq=noraman
keyword: PBEPBE/SDD
title: #p freq=noraman PBEPBE/SDD
converged: YES YES NO NO
title: Mulliken charges:
elementType: O O N N C C C C C C C C C C H H H H H H H H H H H H
charge: -0.301885 -0.320059 -0.422600 -0.157794 -0.304836 -0.463212 0.277879 0.218203 0.178564 -0.322955 -0.326076 -0.246212 -0.252346 -0.528190 0.227370 0.227547 0.229837 0.229950 0.362219 0.319441 0.236849 0.223700 0.222430 0.224929 0.224967 0.242280
chargesum: 0.00000
title: Mulliken charges with hydrogens summed into heavy atoms:
elementType: O O N N C C C C C C C C C C
charge: -0.301885 -0.320059 -0.060381 -0.157794 0.150081 -0.003425 0.277879 0.218203 0.178564 -0.003514 -0.089227 -0.022511 -0.029916 0.163985
polarizability: 1.92482461e+02 -3.00201252e+00 1.42431670e+02 -9.24931681e-02 3.34496487e-02 6.50652422e+01
1716.lowfreq: -7.0852 -3.3905 -0.0006 -0.0003 -0.0001 1.8082 43.8362 59.7383 66.1437
frequency: 43.5927 59.7365 66.1322 98.8397 103.9204 166.2602 194.9585 221.0266 258.8713 286.0975 313.1023 314.8836 456.5254 472.9297 554.2947 557.4906 598.0139 624.0233 669.3706 704.2654 728.4144 744.8712 750.3469 758.4721 816.6483 836.4340 850.7907 872.2432 920.3172 931.1900 958.0469 983.4557 989.5125 997.3998 1040.5836 1082.1868 1106.0304 1118.5062 1152.9333 1158.1393 1172.8342 1192.1983 1200.3555 1201.0566 1256.4069 1300.1356 1307.1960 1317.1825 1402.4684 1432.6760 1452.0746 1466.5272 1469.1943 1476.9804 1484.3120 1490.7523 1529.3386 1602.9960 1616.7014 1674.0955 2964.4825 3000.0828 3027.5416 3046.7029 3053.1931 3097.9081 3125.7047 3133.4162 3149.2794 3162.7205 3171.3243 3533.7378
redmass: 1.8664 3.6844 7.7306 3.5378 4.5249 3.0697 4.5194 1.6171 2.4260 4.4744 5.4176 3.8650 3.2796 6.1153 4.9878 3.8521 6.6171 3.1639 1.4878 7.3022 3.8227 6.3260 1.3049 6.3182 1.1648 5.8380 1.3677 8.1012 3.7015 1.3381 7.9755 1.2876 5.5714 8.4255 2.0516 1.5766 2.0788 1.2568 1.4026 1.0977 1.0700 3.3609 1.2061 2.0619 1.8631 1.2978 1.5117 1.4617 6.3983 1.4256 1.9750 1.0495 1.3527 1.0940 1.3526 1.1519 2.6642 5.8767 6.0087 9.7746 1.0326 1.0583 1.0579 1.1076 1.1042 1.1114 1.0998 1.0854 1.0905 1.0944 1.1000 1.0757
irintensity: 0.0662 6.1713 0.1227 4.5630 2.3534 0.0936 0.6403 2.0070 6.5703 5.4400 0.3607 3.9263 9.7783 5.4836 13.9663 1.7816 5.5512 4.0042 87.4381 11.0317 13.6437 7.9604 111.0348 6.2490 0.2152 2.7991 1.2445 8.1504 59.4744 7.1383 96.6498 3.3037 62.1101 72.0231 27.3707 0.0701 61.1337 0.1914 0.2495 0.4675 2.4644 67.7092 11.1036 44.2357 70.6032 7.2028 15.3642 19.7965 12.0769 37.8670 41.2185 13.7713 91.1819 0.3253 12.2966 2.5776 377.6130 48.5175 148.8992 572.7028 71.2352 64.6873 84.4229 13.2808 45.9666 43.0584 21.3107 1.7002 22.4503 1.4603 30.1048 94.3287
temp: 298.150 k
press: 1.00000 atm
elementType: 8 8 7 7 6 6 6 6 6 6 6 6 6 6 1 1 1 1 1 1 1 1 1 1 1 1
symmnumber: 1
zpe: 544734.1 jmol-1
zpe.correction: 0.207478 hartree
zpe.thermalcorrener: 0.220317 hartree
zpe.thermalcorrenthalpy: 0.221261 hartree
zpe.thermalcorrgfe: 0.167080 hartree
zpe.sumelectzpe: -647.153702 hartree
zpe.sumelectthermal: -647.140864 hartree
zpe.sumelectthermalent: -647.139919 hartree
zpe.sumelectthermalfe: -647.194101 hartree
dipole: -0.4875 -2.0260 0.0188
dipole: 2.0839
quadrupole: -56.3415 -78.4486 -85.5081
quadrupole: 5.5194 -0.0009 0.0384
quadrupole: 17.0912 -5.0159 -12.0754 5.5194 -0.0009 0.0384
hfenergy: -647.3611803 hartree
pointgroup: C01 [X(C10H12N2O2)]
dipole: 0.0768672 0.8150689 -0.0442741 debye
dipolederiv: -1.327808 0.2969612 0.0355793 0.2686522 -0.6922412 0.0111185 0.0414664 0.0078729 -0.2581344 -0.4247173 -0.1347498 0.0138881 -0.4013502 -1.5771163 0.0947121 0.0293466 0.0821013 -0.2997866 -2.1577188 -0.0195035 0.0906193 -0.0601828 -0.4558364 0.0121944 0.0958022 0.0107943 -0.3119239 -0.8921327 -0.1159186 0.032472 -0.5738622 -0.8292406 0.0552989 0.0564205 0.0311708 -0.3730451 0.5947598 -0.0708907 -0.0057554 0.2224839 0.0506291 0.0071103 -0.0231686 0.0210736 0.3539029 0.4525431 0.1719415 -0.0194444 0.0933989 0.2033385 -0.0012781 -0.0135793 -0.0050282 0.2805419 1.3218651 -0.3886812 -0.0354746 -0.7167525 -0.0892881 0.0436215 -0.0169582 0.026401 0.0662535 2.4090053 0.0288944 -0.1132931 0.5606867 1.1993377 -0.0847973 -0.1485569 -0.0568144 0.1918162 -0.3149386 -0.0766056 0.0211488 0.1169636 1.281142 -0.0795791 0.0096153 -0.0705128 0.0428035 -0.1545615 -0.0570665 0.003712 0.2809043 -0.0297098 -0.0212647 -0.0169145 -0.0053341 -0.1610602 0.065267 0.1574579 -0.0208061 -0.1136742 -0.1415877 0.0026407 -0.004323 -0.0096691 -0.188084 -0.0371258 0.0680712 -0.010145 -0.1258978 0.0705975 -0.0086331 0.0009885 -0.0175331 -0.177241 -0.0454121 -0.0704026 -0.0016595 0.1420386 -0.0148921 -0.0170494 -0.0145847 -0.0071523 -0.1849521 0.4905419 0.4650037 -0.035006 0.2515492 0.6240943 -0.0289948 -0.0219715 -0.0381956 0.3306321 -0.0830416 0.039706 -0.0736474 0.015934 0.0671286 0.0382867 -0.1506386 0.0555983 -0.0627915 -0.060734 0.0421555 0.0691542 0.0314605 0.0547022 -0.0558046 0.1471961 -0.0744385 -0.068702 -0.057526 -0.0679739 0.0605565 -0.0250935 0.0208654 0.0765446 0.1462523 0.1193618 -0.084179 -0.0771281 -0.0882167 -0.0515691 -0.0530642 -0.0032115 -0.0804743 -0.1401677 -0.1183965 -0.0362348 0.2597855 0.0428142 0.0009556 0.0742844 0.2737532 -0.000684 -0.0007878 0.0013157 0.3262438 0.163252 -0.0565112 0.0031192 -0.0734544 0.0869094 0.0086702 0.004332 0.0078124 0.1727987 -0.0333784 -0.1044397 0.015179 -0.1139562 0.0167391 0.013969 0.0155635 0.013649 0.1648938 0.0743478 0.0140437 0.0031072 0.0455428 -0.1267231 0.014872 0.0012227 0.0163172 0.1609111 -0.1054229 0.0906239 0.0067661 0.0784747 0.04153 0.0038638 0.0073707 0.003371 0.1651841 -0.0524695 -0.1213782 0.1084545 0.0319884 0.0483006 -0.0716673 0.1116154 0.0051162 -0.0926607 -0.0714364 -0.1341681 -0.0952299 0.0238582 0.0545713 0.0528659 -0.1170109 -0.010167 -0.0799719 0.0641842 0.0888332 -0.0026815 0.0190676 -0.1337922 0.0144581 0.0014697 0.0112861 0.1227859 unknown
polarizability: 192.0298912|3.7894314|142.3046928|-6.2686236|-4.7515034|65.6447884 unknown
InChI: InChI=1S/C10H12N2O2/c1-13-9-5-3-2-4-8(9)12-10-11-6-7-14-10/h2-5,12H,6-7H2,1H3
charge 0 multiplicity 1
26 atoms
O  -3.033487 0.994257 -0.091497
O  1.376059 2.053891 -0.374524
N  -0.758531 0.540403 -0.187509
N  -2.381188 -1.262039 -0.001389
C  -4.318092 0.234723 0.014223
C  -3.873783 -1.270502 0.083925
C  0.476857 -0.144725 -0.20372
C  -2.014348 -0.007343 -0.090935
C  1.647658 0.669193 -0.304558
C  0.614542 -1.549568 -0.127044
C  2.929603 0.088716 -0.327311
C  1.904993 -2.12889 -0.150209
C  3.056821 -1.320845 -0.249348
C  2.51478 2.965203 -0.478085
H  -4.918911 0.474396 -0.878642
H  -4.83461 0.583682 0.923468
H  -4.188961 -1.749027 1.028788
H  -4.290592 -1.861364 -0.751536
H  -0.70175 1.560112 -0.25147
H  -0.290962 -2.157332 -0.050991
H  3.824397 0.713801 -0.404134
H  2.002641 -3.2181 -0.09032
H  4.053505 -1.774305 -0.266691
H  3.097038 2.771509 -1.399568
H  3.176265 2.878129 0.405326
H  2.078553 3.974126 -0.51865
