program: Orca
programVersion: 5.0.2
elementType: S S P O O O N C C C C C C C C C C C C C C H H H H H H H H H H H H H H H H H H H H H H H H H H H H
charge: 0
multiplicity: 1
keywords: wb97x-d3
keywords: def2-TZVPP
keywords: def2/J RIJCOSX
keywords: DEFGRID2
keywords: scfconv7
keywords: smallprint printgap noloewdin
keywords: NOSOSCF
formula: C14H28NO3PS2
InChI: InChI=1/C14H28NO3PS2/c1-4-10-17-19(20,18-11-5-2)21-12-14(16)15-9-7-6-8-13(15)3/h13H,4-12H2,1-3H3
49 atoms
S  -0.277151 -1.836828 -0.634426
S  2.085315 -0.797473 -2.621157
P  1.285383 -0.492932 -0.896689
O  -0.260998 0.335043 2.323767
O  0.595677 0.920399 -0.626395
O  2.245233 -0.623628 0.375106
N  -2.210907 0.316206 1.178623
C  -3.209462 -0.341718 0.328752
C  -3.483637 0.51996 -0.904595
C  -3.857029 1.951853 -0.547412
C  -2.78318 2.55881 0.343484
C  -2.534349 1.687153 1.563489
C  -4.471008 -0.677412 1.114417
C  -1.058817 -0.237847 1.580523
C  -0.719344 -1.648464 1.131249
C  1.286935 2.081532 -0.108202
C  3.149863 -1.734298 0.523845
C  2.326224 2.636072 -1.05554
C  3.941699 -1.530471 1.793948
C  1.775275 3.041727 -2.412594
C  3.091758 -1.517344 3.055413
H  -2.798034 -1.281762 -0.027847
H  -2.586092 0.526531 -1.53057
H  -4.273435 0.044627 -1.489959
H  -3.979519 2.542783 -1.456946
H  -4.820873 1.976232 -0.030524
H  -3.071854 3.555627 0.682476
H  -1.851948 2.670157 -0.22007
H  -3.425038 1.676156 2.19842
H  -1.726611 2.089765 2.166129
H  -4.986626 0.203855 1.494985
H  -4.238684 -1.32428 1.961197
H  -5.168628 -1.212604 0.469842
H  -1.550982 -2.339338 1.279297
H  0.106807 -2.008327 1.740487
H  1.729236 1.841688 0.858843
H  0.49355 2.809555 0.060265
H  2.57532 -2.664526 0.565945
H  3.809577 -1.779753 -0.345044
H  3.147257 1.923992 -1.173441
H  2.755426 3.50748 -0.554221
H  4.52122 -0.607387 1.711595
H  4.668061 -2.344974 1.843552
H  1.397632 2.183986 -2.968808
H  0.962611 3.763057 -2.310791
H  2.552685 3.50527 -3.020076
H  3.718909 -1.40581 3.939804
H  2.532343 -2.4482 3.16418
H  2.375571 -0.695786 3.060052
elementType: S P O N C H
totalener: -1968.77611823 hartree
nucrepener: 2510.00254312 hartree
electener: -4478.77866135 hartree
oneelecener: -7700.36000943 hartree
twoeener: 3221.58134808 hartree
cpcmener: -0.03603757 hartree
kineticenergy: 1962.77395404 hartree
xcener: -137.079078656839 hartree
chargesum: 0.0000000
charge: -0.166140 -0.452437 0.632407 -0.570167 -0.351814 -0.323280 -0.027185 -0.008933 -0.122750 -0.113303 -0.134963 -0.111608 -0.289401 0.255344 -0.103204 0.019995 -0.014148 -0.107325 -0.078214 -0.255775 -0.274975 0.094120 0.067897 0.082853 0.078457 0.078296 0.081554 0.069284 0.115755 0.101323 0.093109 0.097258 0.096614 0.159875 0.145256 0.114088 0.112943 0.112430 0.113881 0.059540 0.081551 0.066229 0.069287 0.070149 0.084294 0.095081 0.100739 0.083396 0.072619
qa: -0.1661 -0.4524 0.6324 -0.5702 -0.3518 -0.3233 -0.0272 -0.0089 -0.1227 -0.1133 -0.1350 -0.1116 -0.2894 0.2553 -0.1032 0.0200 -0.0141 -0.1073 -0.0782 -0.2558 -0.2750 0.0941 0.0679 0.0829 0.0785 0.0783 0.0816 0.0693 0.1158 0.1013 0.0931 0.0973 0.0966 0.1599 0.1453 0.1141 0.1129 0.1124 0.1139 0.0595 0.0816 0.0662 0.0693 0.0701 0.0843 0.0951 0.1007 0.0834 0.0726
va: 2.2902 2.0208 5.4330 1.9006 2.0580 2.0775 3.1633 3.9809 3.8943 3.8725 3.9145 3.8593 3.9552 4.1142 3.8528 3.8146 3.8565 3.9171 3.9077 3.9134 3.9182 1.0109 1.0288 1.0147 1.0121 1.0070 1.0164 1.0153 0.9972 1.0410 1.0011 1.0080 1.0045 1.0008 1.0121 1.0119 0.9842 0.9921 1.0153 1.0259 1.0160 1.0142 1.0118 1.0220 1.0037 1.0043 1.0074 0.9999 1.0201
dispcorr: -0.030199114 hartree
energy: -1968.806317348819
dipole: -9.46561 7.81158 -1.65404 13.52352 -13.48837 0.03515 11.77900 -10.53964 1.23936
magnitude: 2.06715 au
magnitude: 5.25427 debye
