program: Orca
programVersion: 5.0.2
elementType: S S P O O O N C C C C C C C C C C C C C C H H H H H H H H H H H H H H H H H H H H H H H H H H H H
charge: 0
multiplicity: 1
keywords: wb97x-d3
keywords: def2-TZVPP
keywords: def2/J RIJCOSX
keywords: DEFGRID2
keywords: scfconv7
keywords: smallprint printgap noloewdin
keywords: NOSOSCF
formula: C14H28NO3PS2
InChI: InChI=1/C14H28NO3PS2/c1-4-10-17-19(20,18-11-5-2)21-12-14(16)15-9-7-6-8-13(15)3/h13H,4-12H2,1-3H3
49 atoms
S  0.067438 1.311008 0.465829
S  2.104706 1.555935 -2.252373
P  1.694837 0.590276 -0.64355
O  -1.480453 -0.476421 -2.184638
O  2.797876 0.539859 0.512825
O  1.427071 -0.952232 -0.941897
N  -2.708254 -0.407774 -0.282457
C  -3.198426 0.295701 0.90887
C  -3.106572 -0.621614 2.12823
C  -3.792315 -1.961681 1.908352
C  -3.237605 -2.624227 0.655992
C  -3.338605 -1.698777 -0.546079
C  -4.598004 0.855554 0.68489
C  -1.8239 0.102624 -1.153898
C  -1.196861 1.447959 -0.842697
C  3.748835 1.595955 0.759263
C  1.185945 -1.938275 0.083987
C  3.13394 2.796459 1.446249
C  0.666229 -3.194129 -0.578355
C  4.21158 3.801275 1.827271
C  0.465793 -4.299375 0.446824
H  -2.544386 1.140633 1.10791
H  -2.049999 -0.790627 2.357432
H  -3.534811 -0.097993 2.985486
H  -3.641816 -2.603106 2.778636
H  -4.87279 -1.824416 1.806561
H  -3.777641 -3.545279 0.428415
H  -2.190875 -2.900568 0.814761
H  -4.389852 -1.536669 -0.80274
H  -2.870474 -2.152382 -1.414466
H  -4.610795 1.529595 -0.1727
H  -4.909474 1.425346 1.560776
H  -5.344779 0.079986 0.514945
H  -1.910102 2.199662 -0.50566
H  -0.725305 1.8350 -1.745603
H  4.221344 1.883783 -0.18289
H  4.509574 1.138841 1.39147
H  2.121253 -2.138181 0.611148
H  0.459334 -1.554919 0.806795
H  2.595165 2.471587 2.33957
H  2.405239 3.273479 0.786596
H  1.375493 -3.523966 -1.341109
H  -0.276851 -2.977513 -1.085774
H  4.758811 4.15265 0.951198
H  3.773056 4.672571 2.312691
H  4.93491 3.367324 2.519151
H  0.072162 -5.198501 -0.02632
H  -0.236887 -4.002364 1.226763
H  1.405452 -4.56676 0.932778
elementType: S P O N C H
totalener: -1968.77697807 hartree
nucrepener: 2449.33059100 hartree
electener: -4418.10756906 hartree
oneelecener: -7578.58518959 hartree
twoeener: 3160.47762053 hartree
cpcmener: -0.04398108 hartree
kineticenergy: 1962.76912408 hartree
xcener: -137.076467052747 hartree
chargesum: -0.0000000
charge: -0.174637 -0.435283 0.614137 -0.563479 -0.345262 -0.340627 -0.043191 -0.006394 -0.126124 -0.116126 -0.097723 -0.126431 -0.293605 0.256589 -0.068517 0.023699 0.009501 -0.081468 -0.099440 -0.275313 -0.292587 0.092819 0.076057 0.084539 0.077628 0.079232 0.083873 0.041223 0.118946 0.102838 0.097184 0.097474 0.093440 0.152410 0.132793 0.098722 0.109588 0.126454 0.096784 0.070933 0.054957 0.083100 0.063094 0.085756 0.094722 0.085779 0.098096 0.088513 0.095329
qa: -0.1746 -0.4353 0.6141 -0.5635 -0.3453 -0.3406 -0.0432 -0.0064 -0.1261 -0.1161 -0.0977 -0.1264 -0.2936 0.2566 -0.0685 0.0237 0.0095 -0.0815 -0.0994 -0.2753 -0.2926 0.0928 0.0761 0.0845 0.0776 0.0792 0.0839 0.0412 0.1189 0.1028 0.0972 0.0975 0.0934 0.1524 0.1328 0.0987 0.1096 0.1265 0.0968 0.0709 0.0550 0.0831 0.0631 0.0858 0.0947 0.0858 0.0981 0.0885 0.0953
va: 2.2639 2.0311 5.4550 1.9204 2.1005 2.1146 3.1318 3.9779 3.9003 3.8783 3.9105 3.8737 3.9594 4.1249 3.7962 3.8415 3.8116 3.8329 3.8966 3.9698 3.9454 1.0029 1.0193 1.0142 1.0126 1.0066 1.0149 1.0282 0.9973 1.0339 1.0065 1.0046 1.0014 1.0012 1.0505 1.0119 0.9947 1.0034 1.0038 1.0080 1.0241 1.0137 1.0164 1.0010 1.0013 1.0022 1.0027 0.9926 1.0012
dispcorr: -0.027877685 hartree
energy: -1968.804855751256
dipole: -14.57549 12.96058 -1.61491 -11.28101 11.13816 -0.14285 20.89466 -17.08343 3.81123
magnitude: 4.14172 au
magnitude: 10.52740 debye
