program: Orca
programVersion: 5.0.2
elementType: S S P O O O N C C C C C C C C C C C C C C H H H H H H H H H H H H H H H H H H H H H H H H H H H H
charge: 0
multiplicity: 1
keywords: wb97x-d3
keywords: def2-TZVPP
keywords: def2/J RIJCOSX
keywords: DEFGRID2
keywords: scfconv7
keywords: smallprint printgap noloewdin
keywords: NOSOSCF
formula: C14H28NO3PS2
InChI: InChI=1/C14H28NO3PS2/c1-4-10-17-19(20,18-11-5-2)21-12-14(16)15-9-7-6-8-13(15)3/h13H,4-12H2,1-3H3
49 atoms
S  0.092052 1.261439 0.332042
S  2.170161 1.496639 -2.349208
P  1.766975 0.560759 -0.720515
O  -1.41796 -0.871065 -2.013317
O  2.852058 0.581925 0.45077
O  1.558548 -0.998705 -0.975746
N  -2.727024 -0.489929 -0.205197
C  -3.266136 0.402275 0.828074
C  -3.268156 -0.303338 2.18497
C  -3.947869 -1.663915 2.144997
C  -3.311299 -2.520126 1.060719
C  -3.34988 -1.809027 -0.281719
C  -4.634505 0.938533 0.426877
C  -1.800885 -0.130348 -1.107579
C  -1.168424 1.241757 -0.986993
C  3.738473 1.687702 0.713198
C  1.273211 -1.946609 0.073971
C  3.039454 2.865968 1.356399
C  0.906113 -3.268554 -0.560686
C  4.049208 3.92432 1.773021
C  0.616993 -4.309329 0.509371
H  -2.602281 1.256963 0.930647
H  -2.231855 -0.428934 2.512682
H  -3.749063 0.354617 2.911632
H  -3.864343 -2.150002 3.11871
H  -5.01737 -1.551368 1.944526
H  -3.82815 -3.476465 0.960725
H  -2.27282 -2.745692 1.323746
H  -4.38751 -1.695729 -0.610248
H  -2.842202 -2.398041 -1.039296
H  -4.986531 1.648796 1.175325
H  -5.385821 0.153917 0.336797
H  -4.576816 1.462057 -0.528396
H  -1.873628 2.039357 -0.75954
H  -0.692738 1.49638 -1.934085
H  4.230861 1.983919 -0.216013
H  4.496607 1.27897 1.380822
H  2.156307 -2.057701 0.706775
H  0.453528 -1.576065 0.69567
H  2.47579 2.526013 2.228539
H  2.320545 3.30103 0.658162
H  1.726211 -3.608254 -1.197367
H  0.031005 -3.140087 -1.20046
H  4.627482 4.283992 0.920758
H  3.546248 4.783517 2.215493
H  4.751512 3.536399 2.512248
H  0.37266 -5.270718 0.058895
H  -0.227721 -4.013983 1.134392
H  1.477587 -4.460592 1.162554
elementType: S P O N C H
totalener: -1968.77626810 hartree
nucrepener: 2437.32396301 hartree
electener: -4406.10023111 hartree
oneelecener: -7554.59440844 hartree
twoeener: 3148.49417733 hartree
cpcmener: -0.04254328 hartree
kineticenergy: 1962.78135879 hartree
xcener: -137.078024845712 hartree
chargesum: 0.0000000
charge: -0.175024 -0.436021 0.611820 -0.564479 -0.343540 -0.340541 -0.047929 -0.004741 -0.119313 -0.115361 -0.126878 -0.110176 -0.293861 0.259872 -0.061793 0.026513 -0.003511 -0.084083 -0.091488 -0.275606 -0.283625 0.090189 0.074714 0.083261 0.077780 0.078383 0.083119 0.062000 0.117889 0.101694 0.097218 0.093494 0.096857 0.152762 0.128281 0.099551 0.108730 0.132499 0.097545 0.071063 0.056270 0.077619 0.063003 0.085718 0.094894 0.085548 0.095917 0.084419 0.089349
qa: -0.1750 -0.4360 0.6118 -0.5645 -0.3435 -0.3405 -0.0479 -0.0047 -0.1193 -0.1154 -0.1269 -0.1102 -0.2939 0.2599 -0.0618 0.0265 -0.0035 -0.0841 -0.0915 -0.2756 -0.2836 0.0902 0.0747 0.0833 0.0778 0.0784 0.0831 0.0620 0.1179 0.1017 0.0972 0.0935 0.0969 0.1528 0.1283 0.0996 0.1087 0.1325 0.0975 0.0711 0.0563 0.0776 0.0630 0.0857 0.0949 0.0855 0.0959 0.0844 0.0893
va: 2.2627 2.0289 5.4614 1.9236 2.1019 2.1150 3.1426 3.9799 3.8951 3.8785 3.9284 3.8616 3.9626 4.1287 3.7872 3.8391 3.8176 3.8319 3.8943 3.9726 3.9481 1.0014 1.0206 1.0138 1.0127 1.0068 1.0139 1.0172 0.9971 1.0342 1.0048 1.0015 1.0061 0.9998 1.0565 1.0113 0.9945 1.0026 1.0026 1.0073 1.0233 1.0126 1.0239 1.0010 1.0010 1.0022 1.0036 0.9963 1.0021
dispcorr: -0.027251124 hartree
energy: -1968.803519225040
dipole: -15.59715 13.83245 -1.76470 -9.33974 9.57273 0.23299 21.54715 -17.85992 3.68723
magnitude: 4.09440 au
magnitude: 10.40713 debye
