program: Orca
programVersion: 5.0.2
elementType: S S P O O O N C C C C C C C C C C C C C C H H H H H H H H H H H H H H H H H H H H H H H H H H H H
charge: 0
multiplicity: 1
keywords: wb97x-d3
keywords: def2-TZVPP
keywords: def2/J RIJCOSX
keywords: DEFGRID2
keywords: scfconv7
keywords: smallprint printgap noloewdin
keywords: NOSOSCF
formula: C14H28NO3PS2
InChI: InChI=1/C14H28NO3PS2/c1-4-10-17-19(20,18-11-5-2)21-12-14(16)15-9-7-6-8-13(15)3/h13H,4-12H2,1-3H3
49 atoms
S  -0.014337 1.3435 0.332628
S  2.291243 1.093791 -2.167808
P  1.691605 0.426596 -0.469307
O  -1.336655 -0.88939 -2.035069
O  2.665869 0.577059 0.790188
O  1.415579 -1.14134 -0.52742
N  -2.786143 -0.416507 -0.360919
C  -3.345671 0.489544 0.64963
C  -3.24395 -0.150713 2.034897
C  -3.842531 -1.54942 2.083302
C  -3.218076 -2.417749 1.001023
C  -3.353984 -1.761692 -0.363675
C  -4.763985 0.91124 0.287662
C  -1.785782 -0.104882 -1.198649
C  -1.150656 1.266263 -1.092994
C  3.641305 1.632028 0.921461
C  1.030436 -1.938298 0.613349
C  3.019756 2.969485 1.258204
C  0.569208 -3.288048 0.117794
C  4.098153 4.005842 1.533701
C  1.632773 -4.059454 -0.647748
H  -2.747255 1.396016 0.676529
H  -2.188084 -0.199642 2.318347
H  -3.731497 0.50861 2.756078
H  -3.67995 -1.988383 3.069323
H  -4.926066 -1.504787 1.939414
H  -3.693141 -3.400172 0.964189
H  -2.158856 -2.584734 1.220967
H  -4.409723 -1.70086 -0.642333
H  -2.862882 -2.354872 -1.128832
H  -5.127014 1.632641 1.01999
H  -5.466673 0.078422 0.270587
H  -4.786517 1.391668 -0.69099
H  -1.860661 2.082148 -0.966985
H  -0.587392 1.467196 -2.003849
H  4.231052 1.694657 0.004008
H  4.299991 1.299499 1.723313
H  1.891299 -2.043312 1.277171
H  0.230929 -1.435592 1.16415
H  2.372622 2.863149 2.13199
H  2.390644 3.308455 0.431742
H  -0.328272 -3.167823 -0.494179
H  0.26401 -3.853071 1.001925
H  4.720717 3.718716 2.382423
H  4.752808 4.141656 0.671673
H  3.653288 4.973362 1.763703
H  1.904637 -3.564539 -1.580578
H  1.274965 -5.056839 -0.903884
H  2.542016 -4.17731 -0.055221
elementType: S P O N C H
totalener: -1968.77639126 hartree
nucrepener: 2454.99940042 hartree
electener: -4423.77579168 hartree
oneelecener: -7590.16042534 hartree
twoeener: 3166.38463367 hartree
cpcmener: -0.04353071 hartree
kineticenergy: 1962.78408745 hartree
xcener: -137.079465531565 hartree
chargesum: -0.0000000
charge: -0.171374 -0.437297 0.617543 -0.564470 -0.349446 -0.340670 -0.041634 -0.004199 -0.130569 -0.108096 -0.134751 -0.117362 -0.291597 0.253969 -0.071775 0.027253 0.012156 -0.083058 -0.115796 -0.275385 -0.262623 0.090466 0.075608 0.084657 0.078855 0.079063 0.083019 0.070492 0.118925 0.103148 0.096508 0.092407 0.098202 0.154998 0.131424 0.099629 0.110043 0.132706 0.104290 0.070523 0.054949 0.060020 0.077993 0.086086 0.085212 0.094888 0.080020 0.092599 0.082450
qa: -0.1714 -0.4373 0.6175 -0.5645 -0.3494 -0.3407 -0.0416 -0.0042 -0.1306 -0.1081 -0.1348 -0.1174 -0.2916 0.2540 -0.0718 0.0273 0.0122 -0.0831 -0.1158 -0.2754 -0.2626 0.0905 0.0756 0.0847 0.0789 0.0791 0.0830 0.0705 0.1189 0.1031 0.0965 0.0924 0.0982 0.1550 0.1314 0.0996 0.1100 0.1327 0.1043 0.0705 0.0549 0.0600 0.0780 0.0861 0.0852 0.0949 0.0800 0.0926 0.0825
va: 2.2700 2.0270 5.4603 1.9212 2.0966 2.1138 3.1363 3.9790 3.8976 3.8672 3.9131 3.8587 3.9619 4.1483 3.7920 3.8376 3.7912 3.8352 3.9154 3.9699 3.9397 1.0031 1.0208 1.0150 1.0122 1.0068 1.0159 1.0135 0.9978 1.0359 1.0045 1.0016 1.0075 1.0004 1.0515 1.0117 0.9945 1.0014 1.0114 1.0081 1.0246 1.0195 1.0077 1.0020 1.0013 1.0013 1.0111 1.0046 1.0021
dispcorr: -0.027978970 hartree
energy: -1968.804370227455
dipole: -13.81086 11.84341 -1.96746 -7.10636 7.67334 0.56698 17.76581 -14.18262 3.58319
magnitude: 4.12694 au
magnitude: 10.48984 debye
