program: Orca
programVersion: 5.0.2
elementType: S S P O O O N C C C C C C C C C C C C C C H H H H H H H H H H H H H H H H H H H H H H H H H H H H
charge: 0
multiplicity: 1
keywords: wb97x-d3
keywords: def2-TZVPP
keywords: def2/J RIJCOSX
keywords: DEFGRID2
keywords: scfconv7
keywords: smallprint printgap noloewdin
keywords: NOSOSCF
formula: C14H28NO3PS2
InChI: InChI=1/C14H28NO3PS2/c1-4-10-17-19(20,18-11-5-2)21-12-14(16)15-9-7-6-8-13(15)3/h13H,4-12H2,1-3H3
49 atoms
S  -0.407707 1.785138 0.209071
S  2.073184 1.054628 -2.017706
P  1.326803 0.736765 -0.270446
O  -1.405935 -0.713089 -2.23253
O  2.229453 1.135202 0.988993
O  0.918343 -0.764447 0.082544
N  -2.704578 -0.532572 -0.387983
C  -3.408781 0.271903 0.617435
C  -3.211285 -0.337836 2.005324
C  -3.58766 -1.81148 2.055298
C  -2.829654 -2.573715 0.979275
C  -3.041419 -1.953696 -0.39297
C  -4.876557 0.450232 0.247311
C  -1.873746 -0.036411 -1.317006
C  -1.462749 1.423811 -1.233899
C  2.983224 2.365562 1.026761
C  1.759146 -1.895007 -0.239236
C  4.456831 2.098989 0.821965
C  0.881151 -3.097134 -0.498089
C  5.258587 3.384844 0.952464
C  1.722708 -4.33778 -0.753877
H  -2.965178 1.263348 0.643004
H  -2.161657 -0.222161 2.290542
H  -3.798179 0.239701 2.722498
H  -3.361115 -2.219554 3.042029
H  -4.664495 -1.934823 1.908756
H  -3.148995 -3.616925 0.939547
H  -1.760739 -2.576183 1.212026
H  -4.08296 -2.078385 -0.703735
H  -2.430747 -2.460437 -1.134132
H  -5.428978 -0.488956 0.233055
H  -4.973558 0.914286 -0.73481
H  -5.358798 1.104948 0.973692
H  -2.311158 2.105492 -1.157766
H  -0.919861 1.683197 -2.141289
H  2.795609 2.800156 2.009124
H  2.610754 3.069441 0.27754
H  2.369357 -1.668812 -1.117067
H  2.428411 -2.06885 0.605516
H  4.612499 1.658362 -0.165152
H  4.799901 1.369668 1.559446
H  0.237767 -2.898393 -1.357814
H  0.22856 -3.266764 0.36164
H  4.946223 4.127012 0.216266
H  5.14079 3.829696 1.941798
H  6.320933 3.197278 0.800627
H  2.377288 -4.209098 -1.616931
H  1.087082 -5.200911 -0.948944
H  2.348994 -4.578406 0.106294
elementType: S P O N C H
totalener: -1968.77571726 hartree
nucrepener: 2443.73922236 hartree
electener: -4412.51493962 hartree
oneelecener: -7568.12128152 hartree
twoeener: 3155.60634190 hartree
cpcmener: -0.03833580 hartree
kineticenergy: 1962.78280627 hartree
xcener: -137.076777698746 hartree
chargesum: -0.0000000
charge: -0.163656 -0.448884 0.642027 -0.558650 -0.363790 -0.333570 -0.038651 -0.010324 -0.120480 -0.114439 -0.142727 -0.112877 -0.292938 0.252269 -0.082715 0.028483 0.017998 -0.077751 -0.075288 -0.271083 -0.281685 0.094967 0.069318 0.081978 0.078827 0.078552 0.083364 0.070525 0.119336 0.103249 0.093296 0.097799 0.097199 0.156973 0.132850 0.115057 0.089258 0.090973 0.112689 0.053730 0.067888 0.057611 0.072523 0.084267 0.084320 0.093915 0.087695 0.094295 0.086277
qa: -0.1637 -0.4489 0.6420 -0.5586 -0.3638 -0.3336 -0.0387 -0.0103 -0.1205 -0.1144 -0.1427 -0.1129 -0.2929 0.2523 -0.0827 0.0285 0.0180 -0.0778 -0.0753 -0.2711 -0.2817 0.0950 0.0693 0.0820 0.0788 0.0786 0.0834 0.0705 0.1193 0.1032 0.0933 0.0978 0.0972 0.1570 0.1328 0.1151 0.0893 0.0910 0.1127 0.0537 0.0679 0.0576 0.0725 0.0843 0.0843 0.0939 0.0877 0.0943 0.0863
va: 2.2810 1.9967 5.4341 1.9243 2.0965 2.1069 3.1212 3.9828 3.8950 3.8768 3.9115 3.8625 3.9566 4.1124 3.8151 3.8378 3.8415 3.8897 3.8767 3.9485 3.9760 1.0072 1.0286 1.0142 1.0122 1.0068 1.0140 1.0214 0.9975 1.0299 1.0011 1.0073 1.0046 0.9999 1.0422 0.9972 1.0113 1.0127 0.9980 1.0282 1.0122 1.0246 1.0070 1.0008 1.0023 1.0031 0.9997 1.0026 1.0013
dispcorr: -0.027116350 hartree
energy: -1968.802833614521
dipole: -5.43617 4.14664 -1.28953 -13.27778 13.49025 0.21248 12.40031 -9.81717 2.58314
magnitude: 2.89494 au
magnitude: 7.35834 debye
