program: Orca
programVersion: 5.0.2
elementType: S S P O O O N C C C C C C C C C C C C C C H H H H H H H H H H H H H H H H H H H H H H H H H H H H
charge: 0
multiplicity: 1
keywords: wb97x-d3
keywords: def2-TZVPP
keywords: def2/J RIJCOSX
keywords: DEFGRID2
keywords: scfconv7
keywords: smallprint printgap noloewdin
keywords: NOSOSCF
formula: C14H28NO3PS2
InChI: InChI=1/C14H28NO3PS2/c1-4-10-17-19(20,18-11-5-2)21-12-14(16)15-9-7-6-8-13(15)3/h13H,4-12H2,1-3H3
49 atoms
S  0.059937 -1.693481 -0.626594
S  2.153679 0.169753 -2.600762
P  1.551936 -0.245162 -0.822985
O  -1.531828 1.346191 -1.933679
O  0.925633 0.974403 0.008189
O  2.710459 -0.878299 0.074538
N  -2.463349 0.45973 -0.075078
C  -2.828363 -0.668834 0.788179
C  -4.350004 -0.703458 0.954495
C  -4.919479 0.625841 1.434363
C  -4.45541 1.76088 0.532099
C  -2.941831 1.758737 0.388243
C  -2.091537 -0.617538 2.121514
C  -1.768348 0.372863 -1.217731
C  -1.248713 -0.980317 -1.674664
C  1.22468 2.358306 -0.274573
C  2.555926 -1.205734 1.479481
C  2.587592 2.780589 0.225223
C  2.566914 -2.700949 1.698469
C  2.778936 2.638155 1.726283
C  3.820898 -3.392476 1.189026
H  -2.540288 -1.593097 0.293589
H  -4.800114 -0.965099 -0.007339
H  -4.605618 -1.506495 1.649004
H  -6.009865 0.575934 1.4513
H  -4.603596 0.823254 2.462614
H  -4.767817 2.727134 0.933049
H  -4.912296 1.66403 -0.457154
H  -2.474288 1.98396 1.350667
H  -2.618234 2.527901 -0.305757
H  -1.013203 -0.565616 1.969634
H  -2.305146 -1.524463 2.687794
H  -2.385968 0.229953 2.739902
H  -0.860422 -0.869324 -2.685349
H  -2.031606 -1.739579 -1.710433
H  0.433549 2.915514 0.227532
H  1.135229 2.533136 -1.347862
H  3.401555 -0.738542 1.985019
H  1.643713 -0.762882 1.885024
H  2.702499 3.82953 -0.060666
H  3.36666 2.235577 -0.314852
H  1.675807 -3.156016 1.258353
H  2.476031 -2.847437 2.778036
H  2.739982 1.598721 2.0516
H  3.748971 3.033237 2.028296
H  2.013491 3.18765 2.277053
H  3.915468 -3.319904 0.1055
H  3.804852 -4.452202 1.443227
H  4.719365 -2.961086 1.633672
elementType: S P O N C H
totalener: -1968.77369747 hartree
nucrepener: 2487.36368370 hartree
electener: -4456.13738117 hartree
oneelecener: -7654.62651825 hartree
twoeener: 3198.48913708 hartree
cpcmener: -0.04125025 hartree
kineticenergy: 1962.77545518 hartree
xcener: -137.078114663732 hartree
chargesum: 0.0000000
charge: -0.180322 -0.441158 0.634192 -0.561231 -0.345122 -0.361179 -0.034057 0.018580 -0.150490 -0.123723 -0.127738 -0.103322 -0.268104 0.244681 -0.078744 0.022628 -0.033531 -0.093689 -0.088342 -0.261043 -0.247185 0.091722 0.080714 0.080798 0.078375 0.077144 0.076682 0.072030 0.114970 0.095341 0.068336 0.100294 0.098086 0.131852 0.156098 0.113855 0.105294 0.120732 0.128592 0.079410 0.058883 0.059074 0.078570 0.081490 0.094546 0.084562 0.076466 0.092966 0.082013
qa: -0.1803 -0.4412 0.6342 -0.5612 -0.3451 -0.3612 -0.0341 0.0186 -0.1505 -0.1237 -0.1277 -0.1033 -0.2681 0.2447 -0.0787 0.0226 -0.0335 -0.0937 -0.0883 -0.2610 -0.2472 0.0917 0.0807 0.0808 0.0784 0.0771 0.0767 0.0720 0.1150 0.0953 0.0683 0.1003 0.0981 0.1319 0.1561 0.1139 0.1053 0.1207 0.1286 0.0794 0.0589 0.0591 0.0786 0.0815 0.0945 0.0846 0.0765 0.0930 0.0820
va: 2.2653 2.0231 5.4500 1.9233 2.0362 2.0782 3.1351 3.9617 3.9362 3.8786 3.9227 3.8642 3.9342 4.1167 3.8162 3.7998 3.8716 3.9009 3.9255 3.9368 3.9151 1.0064 1.0146 1.0126 1.0122 1.0062 1.0150 1.0126 0.9925 1.0439 1.0225 1.0062 1.0019 1.0421 0.9965 0.9902 1.0240 0.9945 0.9796 1.0133 1.0281 1.0165 1.0122 0.9994 1.0055 1.0026 1.0128 1.0053 1.0024
dispcorr: -0.029037558 hartree
energy: -1968.802735026309
dipole: -9.15652 7.32009 -1.83643 2.95280 -3.72200 -0.76921 26.96958 -23.22927 3.74030
magnitude: 4.23722 au
magnitude: 10.77016 debye
