program: Orca
programVersion: 5.0.2
elementType: S S P O O O N C C C C C C C C C C C C C C H H H H H H H H H H H H H H H H H H H H H H H H H H H H
charge: 0
multiplicity: 1
keywords: wb97x-d3
keywords: def2-TZVPP
keywords: def2/J RIJCOSX
keywords: DEFGRID2
keywords: scfconv7
keywords: smallprint printgap noloewdin
keywords: NOSOSCF
formula: C14H28NO3PS2
InChI: InChI=1/C14H28NO3PS2/c1-4-10-17-19(20,18-11-5-2)21-12-14(16)15-9-7-6-8-13(15)3/h13H,4-12H2,1-3H3
49 atoms
S  -0.010435 -1.750775 -0.7307
S  2.219644 0.165269 -2.499783
P  1.518234 -0.330959 -0.781261
O  -1.47241 1.419806 -1.908689
O  0.859662 0.852153 0.076534
O  2.624075 -1.025051 0.136384
N  -2.473815 0.45452 -0.126164
C  -2.887182 -0.71175 0.661213
C  -4.41198 -0.712153 0.798885
C  -4.952575 0.601585 1.349556
C  -4.440479 1.774778 0.525093
C  -2.925068 1.737158 0.404649
C  -2.175918 -0.758589 2.008813
C  -1.749521 0.414777 -1.253444
C  -1.254724 -0.924597 -1.776357
C  1.298547 2.221478 -0.012219
C  2.428188 -1.344638 1.537258
C  2.624344 2.448369 0.681223
C  2.373704 -2.839439 1.751814
C  2.982713 3.926562 0.680601
C  3.60606 -3.581524 1.260101
H  -2.616336 -1.612957 0.116697
H  -4.850896 -0.901804 -0.184669
H  -4.702689 -1.548453 1.438218
H  -6.044015 0.582362 1.346684
H  -4.649704 0.72735 2.392899
H  -4.732166 2.723779 0.97922
H  -4.88316 1.751119 -0.474775
H  -2.469118 1.893059 1.386365
H  -2.56862 2.536114 -0.237569
H  -1.093998 -0.722008 1.880926
H  -2.420199 -1.692851 2.515132
H  -2.464332 0.056859 2.671382
H  -0.822877 -0.762023 -2.762379
H  -2.060453 -1.651379 -1.891697
H  0.503857 2.7962 0.464371
H  1.349553 2.519721 -1.062063
H  3.281107 -0.910445 2.059656
H  1.526568 -0.865994 1.923831
H  3.411129 1.881337 0.176592
H  2.56833 2.077301 1.707559
H  1.471892 -3.253389 1.293226
H  2.257362 -2.98671 2.828599
H  3.06292 4.317563 -0.335159
H  2.231302 4.518059 1.205918
H  3.939334 4.095051 1.174579
H  3.713827 -3.520892 0.176963
H  3.548254 -4.638192 1.521575
H  4.516192 -3.180782 1.71015
elementType: S P O N C H
totalener: -1968.77410625 hartree
nucrepener: 2474.85765798 hartree
electener: -4443.63176423 hartree
oneelecener: -7629.62841023 hartree
twoeener: 3185.99664600 hartree
cpcmener: -0.04191676 hartree
kineticenergy: 1962.77763655 hartree
xcener: -137.077578842273 hartree
chargesum: 0.0000000
charge: -0.177597 -0.441234 0.626063 -0.561435 -0.336697 -0.361754 -0.033888 0.022724 -0.152136 -0.124423 -0.127547 -0.104726 -0.269186 0.239542 -0.077619 0.023895 -0.024812 -0.077588 -0.086739 -0.273287 -0.247663 0.091827 0.081165 0.081069 0.078343 0.077178 0.077047 0.071963 0.114272 0.096510 0.066239 0.100789 0.098595 0.132487 0.156908 0.111570 0.097264 0.120417 0.125737 0.062636 0.070773 0.056808 0.078652 0.085867 0.085354 0.094863 0.076597 0.092906 0.082273
qa: -0.1776 -0.4412 0.6261 -0.5614 -0.3367 -0.3618 -0.0339 0.0227 -0.1521 -0.1244 -0.1275 -0.1047 -0.2692 0.2395 -0.0776 0.0239 -0.0248 -0.0776 -0.0867 -0.2733 -0.2477 0.0918 0.0812 0.0811 0.0783 0.0772 0.0770 0.0720 0.1143 0.0965 0.0662 0.1008 0.0986 0.1325 0.1569 0.1116 0.0973 0.1204 0.1257 0.0626 0.0708 0.0568 0.0787 0.0859 0.0854 0.0949 0.0766 0.0929 0.0823
va: 2.2658 2.0268 5.4555 1.9225 2.0553 2.0779 3.1315 3.9562 3.9361 3.8787 3.9228 3.8644 3.9355 4.1270 3.8082 3.8027 3.8608 3.8764 3.9174 3.9602 3.9157 1.0069 1.0145 1.0125 1.0123 1.0063 1.0150 1.0126 0.9924 1.0434 1.0227 1.0063 1.0019 1.0421 0.9965 0.9896 1.0190 0.9978 0.9893 1.0265 1.0106 1.0164 1.0123 1.0009 1.0014 1.0027 1.0122 1.0052 1.0024
dispcorr: -0.028433172 hartree
energy: -1968.802539423353
dipole: -9.29977 7.38738 -1.91240 4.57717 -5.47349 -0.89632 25.38054 -21.62228 3.75825
magnitude: 4.31104 au
magnitude: 10.95780 debye
