program: Orca
programVersion: 5.0.2
elementType: S S P O O O N C C C C C C C C C C C C C C H H H H H H H H H H H H H H H H H H H H H H H H H H H H
charge: 0
multiplicity: 1
keywords: wb97x-d3
keywords: def2-TZVPP
keywords: def2/J RIJCOSX
keywords: DEFGRID2
keywords: scfconv7
keywords: smallprint printgap noloewdin
keywords: NOSOSCF
formula: C14H28NO3PS2
InChI: InChI=1/C14H28NO3PS2/c1-4-10-17-19(20,18-11-5-2)21-12-14(16)15-9-7-6-8-13(15)3/h13H,4-12H2,1-3H3
49 atoms
S  -0.496231 1.850007 0.287498
S  1.976024 1.054041 -1.952051
P  1.145279 0.684958 -0.253748
O  -1.582096 -0.473353 -2.288558
O  2.036405 0.900284 1.056858
O  0.601643 -0.801947 -0.033126
N  -2.809379 -0.417007 -0.389918
C  -3.480721 0.312473 0.692506
C  -3.167924 -0.343077 2.037457
C  -3.462274 -1.836464 2.043651
C  -2.737293 -2.512489 0.889743
C  -3.079434 -1.851259 -0.436164
C  -4.975596 0.434517 0.421135
C  -2.015406 0.141891 -1.314006
C  -1.593951 1.59191 -1.147146
C  3.050413 1.921237 1.161255
C  1.099677 -1.932936 -0.778356
C  4.415662 1.282619 1.275008
C  2.466101 -2.380046 -0.308163
C  5.492537 2.341004 1.4586
C  2.902812 -3.626481 -1.063917
H  -3.082677 1.322875 0.730188
H  -2.110018 -0.181763 2.264071
H  -3.73867 0.170316 2.814143
H  -3.153942 -2.272158 2.995884
H  -4.538433 -2.013086 1.957053
H  -3.001122 -3.570115 0.828299
H  -1.655923 -2.461783 1.049774
H  -4.134391 -2.014884 -0.675276
H  -2.502533 -2.293589 -1.242761
H  -5.440153 1.033791 1.204739
H  -5.484912 -0.52872 0.398718
H  -5.156124 0.934741 -0.530912
H  -2.435228 2.270377 -0.999169
H  -1.076754 1.908267 -2.051125
H  2.811167 2.505447 2.05106
H  3.009522 2.591985 0.299139
H  0.355259 -2.714251 -0.621294
H  1.114912 -1.68866 -1.843084
H  4.616495 0.695486 0.374789
H  4.424906 0.589979 2.120439
H  2.440081 -2.580951 0.765688
H  3.194849 -1.580563 -0.469144
H  5.316957 2.937211 2.356412
H  6.475787 1.881231 1.556172
H  5.530498 3.024529 0.608079
H  3.892652 -3.950373 -0.742104
H  2.949241 -3.444047 -2.139451
H  2.21312 -4.455805 -0.897372
elementType: S P O N C H
totalener: -1968.77507467 hartree
nucrepener: 2460.97553872 hartree
electener: -4429.75061339 hartree
oneelecener: -7602.50303693 hartree
twoeener: 3172.75242354 hartree
cpcmener: -0.03673395 hartree
kineticenergy: 1962.77009997 hartree
xcener: -137.075585026945 hartree
chargesum: -0.0000000
charge: -0.161818 -0.446432 0.629800 -0.557557 -0.363379 -0.350749 -0.035976 -0.007055 -0.123254 -0.110248 -0.136043 -0.112660 -0.290522 0.249143 -0.084203 0.033741 0.026837 -0.077286 -0.070154 -0.274159 -0.274599 0.092475 0.069261 0.081869 0.078778 0.076551 0.081791 0.067679 0.116299 0.101618 0.096863 0.092505 0.097683 0.157061 0.129474 0.113667 0.087748 0.110971 0.101561 0.057847 0.071302 0.073344 0.049460 0.084423 0.094108 0.085518 0.094384 0.084809 0.087522
qa: -0.1618 -0.4464 0.6298 -0.5576 -0.3634 -0.3507 -0.0360 -0.0071 -0.1233 -0.1102 -0.1360 -0.1127 -0.2905 0.2491 -0.0842 0.0337 0.0268 -0.0773 -0.0702 -0.2742 -0.2746 0.0925 0.0693 0.0819 0.0788 0.0766 0.0818 0.0677 0.1163 0.1016 0.0969 0.0925 0.0977 0.1571 0.1295 0.1137 0.0877 0.1110 0.1016 0.0578 0.0713 0.0733 0.0495 0.0844 0.0941 0.0855 0.0944 0.0848 0.0875
va: 2.2844 1.9921 5.4319 1.9273 2.0942 2.0868 3.1203 3.9817 3.8896 3.8699 3.9103 3.8603 3.9567 4.1190 3.8185 3.8235 3.7923 3.8889 3.8994 3.9582 3.9552 1.0083 1.0300 1.0147 1.0121 1.0072 1.0154 1.0179 0.9982 1.0381 1.0046 1.0013 1.0076 0.9988 1.0429 0.9974 1.0158 0.9885 1.0203 1.0165 1.0104 1.0126 1.0245 1.0021 1.0030 1.0000 1.0032 1.0010 1.0013
dispcorr: -0.027758171 hartree
energy: -1968.802832840570
dipole: -0.29879 -0.84094 -1.13973 -14.51422 14.46163 -0.05258 12.77232 -10.29042 2.48190
magnitude: 2.73159 au
magnitude: 6.94315 debye
