program: Gaussian 09
title: 000056140
version: EM64L-G09RevD.01
frameworkgroup: C1[X(C8H18N2O2)]
method: RPBEPBE
basis: SDD
operation: Freq
keyword: #p
keyword: freq=noraman
keyword: PBEPBE/SDD
title: #p freq=noraman PBEPBE/SDD
converged: YES YES NO NO
title: Mulliken charges:
elementType: O O N N C C C C C C C C H H H H H H H H H H H H H H H H H H
charge: -0.429818 -0.217394 -0.319451 -0.091729 -0.452787 -0.341802 -0.349651 -0.100227 -0.728488 -0.623793 -0.606876 0.184651 0.233222 0.187054 0.211722 0.227610 0.187144 0.210677 0.222017 0.254005 0.248965 0.214394 0.237817 0.228020 0.187783 0.220668 0.219262 0.185385 0.226357 0.375262
chargesum: 0.00000
title: Mulliken charges with hydrogens summed into heavy atoms:
elementType: O O N N C C C C C C C C
charge: -0.054555 -0.217394 -0.065445 -0.091729 -0.032511 0.097529 0.048170 0.121790 -0.027311 0.012678 0.024128 0.184651
polarizability: 1.25215187e+02 1.10003796e+00 1.04178688e+02 -4.40372866e+00 -2.19745465e+00 9.50513194e+01
1716.lowfreq: -4.0179 -0.0010 -0.0009 -0.0006 7.0835 15.3993 27.6970 40.1576 45.5893
frequency: 27.5882 40.1352 45.4419 56.9224 73.8361 130.8397 144.6768 209.0073 214.2285 230.5599 239.9877 272.5508 297.9634 301.7422 313.4776 351.2953 414.4913 428.2149 471.5252 517.4684 566.4426 579.0268 624.9526 692.9386 743.3700 769.9864 816.2700 889.3114 942.2277 964.1285 1013.4763 1025.0394 1034.4828 1056.7159 1072.8916 1077.5026 1088.8887 1106.4998 1121.6437 1142.0094 1170.0812 1201.4348 1224.0294 1247.0400 1257.9689 1268.6982 1280.6423 1287.0775 1323.9091 1348.0343 1367.0304 1379.4309 1382.6148 1417.6110 1440.6016 1454.7720 1457.6920 1462.2712 1473.0784 1475.0836 1478.3237 1481.4655 1482.7847 1485.6849 1496.5378 1674.2506 2824.1435 2838.0409 2848.9355 2855.8980 2903.1455 2970.1562 2991.5775 3011.7150 3017.1552 3022.7853 3024.9055 3047.8224 3076.2594 3081.4717 3085.7978 3119.4936 3461.0867 3518.0573
redmass: 3.6088 8.2796 3.0500 2.9662 4.0698 2.3420 2.8230 1.3616 1.3818 1.2658 1.6635 1.9692 2.6294 3.2249 2.8279 2.0274 2.1981 2.4422 2.8612 2.1790 2.2040 1.5066 2.5520 3.8083 2.1382 2.7115 1.6101 1.7114 1.6582 2.0785 2.6338 2.5232 1.5527 2.1194 1.6597 2.1337 1.3720 2.2462 1.6321 1.7166 2.0097 1.8153 1.7598 1.5827 1.9570 1.6235 1.4289 1.2752 1.2925 1.6365 1.3805 1.4792 1.2052 1.1428 1.1670 1.1861 1.0552 1.0585 1.0753 1.0753 1.0676 1.0621 1.0930 1.0569 1.0837 8.6481 1.0702 1.0577 1.0794 1.0583 1.0698 1.0657 1.0364 1.0859 1.0714 1.0871 1.0716 1.0984 1.1011 1.1005 1.0992 1.1001 1.0748 1.0641
irintensity: 0.3035 1.8370 0.7727 1.1886 0.6822 2.9194 0.3802 0.7003 0.2864 0.5311 0.6184 1.1044 0.4346 12.1088 1.7034 6.1066 0.8886 7.6244 21.0849 87.0476 24.1801 46.7519 90.8662 27.9803 13.9784 1.7480 5.1281 0.5783 1.0955 26.6243 187.1179 156.5421 22.2815 7.5845 15.5676 24.5422 14.6134 5.5273 3.4950 4.8837 28.8297 21.1881 5.0009 24.7936 3.4299 0.6453 15.2667 6.5207 2.5323 16.6366 6.2836 4.7006 17.7062 2.3306 4.7043 21.0918 4.6327 14.8062 15.3105 11.0536 8.4985 5.3206 20.8909 15.3315 4.5594 203.1177 70.3550 74.9730 73.2925 264.2217 65.3874 29.7144 26.9555 31.7730 40.5738 11.1888 38.5290 59.1862 29.8848 51.3071 26.8024 15.9857 0.6432 22.2752
temp: 298.150 k
press: 1.00000 atm
elementType: 8 8 7 7 6 6 6 6 6 6 6 6 1 1 1 1 1 1 1 1 1 1 1 1 1 1 1 1 1 1
symmnumber: 1
zpe: 680832.8 jmol-1
zpe.correction: 0.259316 hartree
zpe.thermalcorrener: 0.274388 hartree
zpe.thermalcorrenthalpy: 0.275332 hartree
zpe.thermalcorrgfe: 0.215654 hartree
zpe.sumelectzpe: -574.571904 hartree
zpe.sumelectthermal: -574.556831 hartree
zpe.sumelectthermalent: -574.555887 hartree
zpe.sumelectthermalfe: -574.615565 hartree
dipole: -0.8428 1.4599 -1.3466
dipole: 2.1575
quadrupole: -65.5297 -69.4597 -79.5190
quadrupole: -0.4460 -3.4045 2.0301
quadrupole: 5.9731 2.0431 -8.0162 -0.4460 -3.4045 2.0301
hfenergy: -574.8312191 hartree
pointgroup: C01 [X(C8H18N2O2)]
dipole: -0.3231759 0.4922472 -0.611339 debye
polarizability: 125.1327561|-0.2735791|103.2554422|-4.8869646|-3.3841418|96.0569966 unknown
InChI: InChI=1S/C8H18N2O2/c1-7(8(11)12)9-5-4-6-10(2)3/h7,9,11H,4-6H2,1-3H3
charge 0 multiplicity 1
30 atoms
O  3.74358 -1.355495 -0.850631
O  2.457287 -1.462321 1.07759
N  1.055009 0.915585 0.281355
N  -3.19536 -0.19641 -0.370685
C  -1.298733 0.743626 1.035149
C  -0.19493 0.132491 0.1532
C  -2.618024 -0.054195 0.99029
C  2.199544 0.465905 -0.512904
C  3.312451 1.544559 -0.51315
C  -3.637349 1.086718 -0.951821
C  -4.27027 -1.20898 -0.402571
C  2.766048 -0.854025 0.034244
H  -0.940312 0.769562 2.081871
H  -1.476845 1.798905 0.73998
H  -0.558566 0.060768 -0.899235
H  0.009204 -0.898192 0.498758
H  -3.352379 0.421011 1.694507
H  -2.423908 -1.075471 1.372535
H  1.935655 0.245455 -1.579248
H  0.899214 1.925773 0.176046
H  4.19176 1.198656 -1.078888
H  2.935042 2.470679 -0.985134
H  3.613902 1.777418 0.522988
H  -2.785522 1.782298 -1.044351
H  -4.432951 1.593652 -0.345771
H  -4.039625 0.911635 -1.965697
H  -4.625199 -1.343824 -1.440296
H  -5.155077 -0.940259 0.231178
H  -3.878545 -2.178459 -0.046201
H  4.1004 -2.209266 -0.484108
