program: Orca
programVersion: 5.0.2
elementType: S S P O O O N C C C C C C C C C C C C C C H H H H H H H H H H H H H H H H H H H H H H H H H H H H
charge: 0
multiplicity: 1
keywords: wb97x-d3
keywords: def2-TZVPP
keywords: def2/J RIJCOSX
keywords: DEFGRID2
keywords: scfconv7
keywords: smallprint printgap noloewdin
keywords: NOSOSCF
formula: C14H28NO3PS2
InChI: InChI=1/C14H28NO3PS2/c1-4-10-17-19(20,18-11-5-2)21-12-14(16)15-9-7-6-8-13(15)3/h13H,4-12H2,1-3H3
49 atoms
S  -0.40163 1.567223 0.890573
S  1.893199 1.681008 -1.64462
P  1.187871 0.703539 -0.142698
O  -1.74465 0.299046 -2.232185
O  2.164519 0.473962 1.105042
O  0.66121 -0.777122 -0.429795
N  -2.911808 -0.245703 -0.374901
C  -3.419508 0.039063 0.969876
C  -2.997214 -1.080758 1.922931
C  -3.385776 -2.462666 1.413337
C  -2.856875 -2.668582 0.000538
C  -3.304617 -1.541385 -0.918061
C  -4.925671 0.276167 0.955445
C  -2.105756 0.558674 -1.088826
C  -1.599845 1.844973 -0.456737
C  3.249379 1.366419 1.426767
C  1.065675 -1.536831 -1.589442
C  4.577959 0.724175 1.096627
C  2.46385 -2.097417 -1.46267
C  5.733893 1.634664 1.478662
C  2.668263 -2.997653 -0.255599
H  -2.961993 0.957404 1.328438
H  -1.911334 -1.034072 2.047142
H  -3.435364 -0.8911 2.905508
H  -2.991577 -3.229025 2.084051
H  -4.473768 -2.57911 1.419228
H  -3.204176 -3.618571 -0.411551
H  -1.763051 -2.707914 0.0138
H  -4.39099 -1.567727 -1.042615
H  -2.872759 -1.655737 -1.90783
H  -5.258533 0.570719 1.951388
H  -5.497598 -0.606201 0.668427
H  -5.184766 1.08216 0.267515
H  -2.395357 2.453041 -0.023466
H  -1.122553 2.441944 -1.232516
H  3.166092 1.573048 2.494666
H  3.135847 2.314342 0.894984
H  0.328262 -2.33651 -1.662806
H  0.976034 -0.913847 -2.480803
H  4.617064 0.502827 0.027133
H  4.665407 -0.227253 1.626307
H  3.192353 -1.28179 -1.459502
H  2.65069 -2.661454 -2.381007
H  6.690261 1.159087 1.261544
H  5.702032 2.57529 0.926011
H  5.721143 1.873962 2.543479
H  1.959325 -3.82783 -0.252837
H  2.548752 -2.458163 0.683924
H  3.672272 -3.423395 -0.2590
elementType: S P O N C H
totalener: -1968.78742530 hartree
nucrepener: 2470.38082506 hartree
electener: -4439.16825036 hartree
oneelecener: -7621.12179608 hartree
twoeener: 3181.95354572 hartree
cpcmener: -0.02864543 hartree
kineticenergy: 1962.77436580 hartree
xcener: -137.075162092456 hartree
chargesum: 0.0000000
charge: -0.166034 -0.439295 0.633783 -0.519248 -0.358797 -0.347375 -0.044074 -0.003066 -0.126440 -0.114684 -0.127662 -0.109110 -0.288584 0.235137 -0.091353 0.032416 0.014316 -0.079797 -0.093757 -0.272140 -0.256605 0.088823 0.069282 0.080641 0.078683 0.075791 0.078777 0.065753 0.112312 0.100180 0.095435 0.090886 0.097553 0.153665 0.131807 0.111305 0.088626 0.110431 0.112873 0.057442 0.070167 0.056897 0.080840 0.093382 0.085612 0.083553 0.084829 0.072651 0.094172
qa: -0.1660 -0.4393 0.6338 -0.5192 -0.3588 -0.3474 -0.0441 -0.0031 -0.1264 -0.1147 -0.1277 -0.1091 -0.2886 0.2351 -0.0914 0.0324 0.0143 -0.0798 -0.0938 -0.2721 -0.2566 0.0888 0.0693 0.0806 0.0787 0.0758 0.0788 0.0658 0.1123 0.1002 0.0954 0.0909 0.0976 0.1537 0.1318 0.1113 0.0886 0.1104 0.1129 0.0574 0.0702 0.0569 0.0808 0.0934 0.0856 0.0836 0.0848 0.0727 0.0942
va: 2.2854 1.9993 5.4317 1.9771 2.0984 2.0744 3.1199 3.9811 3.8920 3.8719 3.9109 3.8599 3.9547 4.1484 3.8051 3.8289 3.8039 3.8870 3.9041 3.9615 3.9232 1.0085 1.0319 1.0147 1.0123 1.0071 1.0159 1.0167 0.9971 1.0439 1.0049 1.0012 1.0084 0.9996 1.0431 0.9980 1.0171 0.9902 1.0249 1.0172 1.0098 1.0209 1.0148 1.0031 1.0008 1.0021 1.0040 1.0161 1.0044
dispcorr: -0.028386572 hartree
energy: -1968.815811869463
dipole: 0.02979 -0.91465 -0.88486 -17.83056 16.96852 -0.86204 10.01410 -7.92480 2.08930
magnitude: 2.42720 au
magnitude: 6.16945 debye
