program: Orca
programVersion: 5.0.2
elementType: S S P O O O N C C C C C C C C C C C C C C H H H H H H H H H H H H H H H H H H H H H H H H H H H H
charge: 0
multiplicity: 1
keywords: wb97x-d3
keywords: def2-TZVPP
keywords: def2/J RIJCOSX
keywords: DEFGRID2
keywords: scfconv7
keywords: smallprint printgap noloewdin
keywords: NOSOSCF
formula: C14H28NO3PS2
InChI: InChI=1/C14H28NO3PS2/c1-4-10-17-19(20,18-11-5-2)21-12-14(16)15-9-7-6-8-13(15)3/h13H,4-12H2,1-3H3
49 atoms
S  -0.108074 1.47454 0.838317
S  2.14186 1.434079 -1.768105
P  1.368817 0.505761 -0.268967
O  -1.69675 0.406202 -2.274509
O  2.332975 0.147956 0.952933
O  0.636831 -0.8756 -0.609393
N  -2.798353 -0.087423 -0.363221
C  -3.253246 0.243251 0.989434
C  -2.963143 -0.927042 1.930785
C  -3.521053 -2.246497 1.413907
C  -3.025789 -2.501988 -0.002653
C  -3.341191 -1.324577 -0.91268
C  -4.71843 0.666589 0.989077
C  -1.966012 0.662543 -1.105891
C  -1.309537 1.87866 -0.472535
C  3.739313 0.448214 1.045389
C  1.001076 -1.693988 -1.736867
C  3.997428 1.569587 2.026971
C  2.294324 -2.446344 -1.512594
C  3.497194 2.932541 1.576221
C  2.286395 -3.343323 -0.284332
H  -2.682118 1.094318 1.351493
H  -1.878614 -1.01427 2.046873
H  -3.36797 -0.692662 2.918014
H  -3.221699 -3.06093 2.076725
H  -4.615169 -2.227468 1.424249
H  -3.48136 -3.402478 -0.420124
H  -1.943338 -2.665795 0.006697
H  -4.423636 -1.224779 -1.038059
H  -2.924266 -1.483537 -1.902718
H  -4.874811 1.513735 0.319603
H  -5.011159 0.97895 1.992176
H  -5.396637 -0.130258 0.683715
H  -2.027801 2.556592 -0.009258
H  -0.800534 2.438061 -1.256373
H  4.137328 0.69289 0.058106
H  4.214645 -0.473946 1.380062
H  0.165341 -2.38401 -1.858965
H  1.058671 -1.074322 -2.634119
H  5.08047 1.607612 2.172027
H  3.570181 1.308656 2.998783
H  3.131581 -1.743346 -1.466248
H  2.461013 -3.048817 -2.409887
H  3.928813 3.218371 0.61617
H  2.411711 2.962875 1.474059
H  3.769871 3.699194 2.302509
H  2.185185 -2.773916 0.639734
H  3.215143 -3.910751 -0.214902
H  1.465103 -4.062006 -0.322046
elementType: S P O N C H
totalener: -1968.78662173 hartree
nucrepener: 2492.74622571 hartree
electener: -4461.53284745 hartree
oneelecener: -7665.92825122 hartree
twoeener: 3204.39540378 hartree
cpcmener: -0.02914961 hartree
kineticenergy: 1962.78025954 hartree
xcener: -137.078370881499 hartree
chargesum: -0.0000000
charge: -0.164168 -0.437402 0.639934 -0.519261 -0.359190 -0.346697 -0.044602 -0.004577 -0.125987 -0.114295 -0.125433 -0.110891 -0.290394 0.229971 -0.084314 0.030332 0.002458 -0.081578 -0.092536 -0.265610 -0.259828 0.090915 0.070396 0.080442 0.078213 0.075534 0.078123 0.064616 0.111627 0.100434 0.097860 0.095649 0.090851 0.154302 0.130719 0.096221 0.108914 0.109900 0.113686 0.068184 0.065057 0.059546 0.081340 0.081770 0.070643 0.096183 0.075891 0.094254 0.082799
qa: -0.1642 -0.4374 0.6399 -0.5193 -0.3592 -0.3467 -0.0446 -0.0046 -0.1260 -0.1143 -0.1254 -0.1109 -0.2904 0.2300 -0.0843 0.0303 0.0025 -0.0816 -0.0925 -0.2656 -0.2598 0.0909 0.0704 0.0804 0.0782 0.0755 0.0781 0.0646 0.1116 0.1004 0.0979 0.0956 0.0909 0.1543 0.1307 0.0962 0.1089 0.1099 0.1137 0.0682 0.0651 0.0595 0.0813 0.0818 0.0706 0.0962 0.0759 0.0943 0.0828
va: 2.2810 2.0047 5.4326 1.9772 2.0891 2.0768 3.1093 3.9780 3.8928 3.8711 3.9130 3.8639 3.9548 4.1524 3.7994 3.8336 3.8244 3.8963 3.8840 3.9128 3.9272 1.0077 1.0296 1.0146 1.0123 1.0072 1.0156 1.0163 0.9972 1.0426 1.0077 1.0048 1.0014 0.9989 1.0438 1.0172 0.9967 0.9905 1.0248 1.0129 1.0128 1.0213 1.0143 1.0090 1.0252 1.0076 1.0128 1.0046 1.0036
dispcorr: -0.029110028 hartree
energy: -1968.815731763245
dipole: -6.44043 5.71586 -0.72457 -14.17531 13.15098 -1.02433 11.61832 -9.48024 2.13808
magnitude: 2.47904 au
magnitude: 6.30121 debye
