program: Orca
programVersion: 5.0.2
elementType: S S P O O O N C C C C C C C C C C C C C C H H H H H H H H H H H H H H H H H H H H H H H H H H H H
charge: 0
multiplicity: 1
keywords: wb97x-d3
keywords: def2-TZVPP
keywords: def2/J RIJCOSX
keywords: DEFGRID2
keywords: scfconv7
keywords: smallprint printgap noloewdin
keywords: NOSOSCF
formula: C14H28NO3PS2
InChI: InChI=1/C14H28NO3PS2/c1-4-10-17-19(20,18-11-5-2)21-12-14(16)15-9-7-6-8-13(15)3/h13H,4-12H2,1-3H3
49 atoms
S  -0.081506 -1.645501 0.21771
S  2.132891 -0.42428 -2.097347
P  1.425549 -0.30719 -0.310978
O  -1.570728 0.719437 -2.193107
O  0.775359 1.092297 0.107863
O  2.43961 -0.582802 0.898657
N  -2.585488 0.501767 -0.186084
C  -3.04352 -0.294704 0.954484
C  -4.57493 -0.31397 0.96806
C  -5.180957 1.083127 0.924904
C  -4.614292 1.876894 -0.245176
C  -3.093672 1.867501 -0.22025
C  -2.442554 0.201275 2.264331
C  -1.835479 0.045169 -1.20302
C  -1.272525 -1.366723 -1.13404
C  1.115812 2.338995 -0.533495
C  3.62112 -1.397212 0.770475
C  2.474122 2.859143 -0.121552
C  3.314235 -2.878824 0.758976
C  2.626868 3.089682 1.372791
C  4.600623 -3.690482 0.735305
H  -2.712569 -1.32087 0.814594
H  -4.920425 -0.885288 0.101002
H  -4.912867 -0.854834 1.855137
H  -6.267869 1.011653 0.846007
H  -4.976354 1.613274 1.859707
H  -4.964872 2.911005 -0.217522
H  -4.959439 1.448761 -1.191303
H  -2.728052 2.402367 0.661146
H  -2.686909 2.375688 -1.08966
H  -2.808812 1.184705 2.558072
H  -1.356238 0.253105 2.19611
H  -2.693962 -0.492853 3.067183
H  -0.782437 -1.580376 -2.082414
H  -2.049598 -2.120713 -0.995715
H  0.325699 3.025073 -0.228215
H  1.056487 2.216813 -1.616598
H  4.168641 -1.103657 -0.128446
H  4.231473 -1.135644 1.635418
H  2.615119 3.802498 -0.656584
H  3.25575 2.187364 -0.487003
H  2.708625 -3.128387 -0.116136
H  2.725174 -3.138383 1.642149
H  1.865627 3.775114 1.749696
H  2.54979 2.162897 1.941435
H  3.60022 3.526323 1.596763
H  4.384264 -4.758712 0.732437
H  5.222032 -3.483141 1.608292
H  5.194716 -3.473818 -0.154193
elementType: S P O N C H
totalener: -1968.78680998 hartree
nucrepener: 2465.53497147 hartree
electener: -4434.32178145 hartree
oneelecener: -7611.39816909 hartree
twoeener: 3177.07638764 hartree
cpcmener: -0.02894679 hartree
kineticenergy: 1962.78588520 hartree
xcener: -137.078237040023 hartree
chargesum: 0.0000000
charge: -0.162575 -0.437612 0.643203 -0.518911 -0.348739 -0.361643 -0.044552 0.013659 -0.145780 -0.125268 -0.125898 -0.109006 -0.283460 0.237038 -0.091806 0.013140 0.033574 -0.096685 -0.087962 -0.253182 -0.273292 0.088945 0.079754 0.079441 0.078620 0.075778 0.075782 0.071792 0.112045 0.097003 0.094909 0.084587 0.098382 0.132163 0.152595 0.110594 0.109389 0.096490 0.110124 0.078547 0.058737 0.057260 0.070439 0.081008 0.074861 0.092820 0.094230 0.084112 0.085352
qa: -0.1626 -0.4376 0.6432 -0.5189 -0.3487 -0.3616 -0.0446 0.0137 -0.1458 -0.1253 -0.1259 -0.1090 -0.2835 0.2370 -0.0918 0.0131 0.0336 -0.0967 -0.0880 -0.2532 -0.2733 0.0889 0.0798 0.0794 0.0786 0.0758 0.0758 0.0718 0.1120 0.0970 0.0949 0.0846 0.0984 0.1322 0.1526 0.1106 0.1094 0.0965 0.1101 0.0785 0.0587 0.0573 0.0704 0.0810 0.0749 0.0928 0.0942 0.0841 0.0854
va: 2.2788 2.0085 5.4024 1.9756 2.0781 2.1028 3.1042 3.9593 3.9300 3.8800 3.9162 3.8678 3.9260 4.1348 3.8156 3.8182 3.8320 3.8981 3.8537 3.9304 3.9642 1.0086 1.0140 1.0131 1.0119 1.0062 1.0151 1.0130 0.9929 1.0445 1.0009 1.0297 1.0058 1.0424 0.9977 0.9904 1.0212 1.0143 0.9943 1.0130 1.0263 1.0270 1.0094 1.0024 1.0147 1.0050 1.0019 1.0020 1.0014
dispcorr: -0.027905277 hartree
energy: -1968.814715255141
dipole: -5.59886 4.63171 -0.96715 6.49571 -6.74126 -0.24555 16.08569 -13.77179 2.31390
magnitude: 2.51988 au
magnitude: 6.40503 debye
