program: Gaussian 09
title: 000056158
version: EM64L-G09RevD.01
frameworkgroup: C1[X(C8H15N3O5)]
method: RPBEPBE
basis: SDD
operation: Freq
keyword: #p
keyword: freq=noraman
keyword: PBEPBE/SDD
title: #p freq=noraman PBEPBE/SDD
converged: YES YES NO NO
title: Mulliken charges:
elementType: O O O O O N N N C C C C C C C C H H H H H H H H H H H H H H H
charge: -0.415728 -0.241790 -0.244261 -0.256838 -0.219697 -0.171873 -0.655300 0.103280 -0.372733 -0.378986 -0.360069 -0.107845 -0.437321 0.156327 0.354934 -0.495772 0.196975 0.251004 0.208912 0.219238 0.235653 0.202707 0.218643 0.252620 0.250546 0.274592 0.315204 0.383959 0.245046 0.242820 0.245753
chargesum: 0.00000
title: Mulliken charges with hydrogens summed into heavy atoms:
elementType: O O O O O N N N C C C C C C C C
charge: -0.031770 -0.241790 -0.244261 -0.256838 -0.219697 -0.171873 -0.065503 0.103280 0.075246 0.049164 0.078291 0.110798 0.065846 0.156327 0.354934 0.237846
polarizability: 1.31761287e+02 -4.37703535e+00 1.31863617e+02 -8.02763361e+00 -2.17546140e+00 1.16563181e+02
1716.lowfreq: -6.7543 -0.0006 0.0002 0.0003 3.6695 8.6190 19.7043 26.3855 26.8791
frequency: 19.6557 26.3670 26.8336 37.8961 54.0212 79.7610 93.9958 111.5054 127.2633 138.7780 176.8200 181.3724 202.6613 229.2050 236.0425 292.4441 300.4432 315.3993 323.4991 362.1479 404.1781 434.1134 454.9782 467.0995 494.9124 539.5428 574.5047 612.7832 692.3053 700.5904 713.5674 725.8500 739.1238 788.7204 823.6637 874.3762 896.2386 953.2743 978.1301 1012.1119 1053.9928 1062.7377 1067.7218 1095.0358 1102.6309 1116.6911 1131.2471 1150.4589 1166.0995 1188.2364 1230.7362 1254.5195 1271.7423 1273.3007 1295.2940 1305.1172 1326.2804 1347.8204 1351.3416 1359.6601 1378.2613 1380.2320 1426.0084 1439.9022 1453.8249 1460.7156 1462.8760 1466.2562 1485.7625 1600.6367 1623.5343 1662.2755 2849.2817 2974.7451 2981.6847 2987.4189 3009.0855 3023.5133 3035.9188 3044.0689 3070.8997 3100.8769 3113.3935 3157.8523 3502.9642 3509.1104 3648.8304
redmass: 5.4769 7.5696 6.2811 7.0645 5.0489 3.0890 1.4630 3.2408 1.9454 3.1068 2.9983 4.9492 1.3624 2.8126 6.4908 5.9055 4.5601 3.9566 3.4617 2.3788 5.2128 5.0985 9.7436 1.3108 4.0015 2.5067 2.3011 1.7161 3.0156 8.5665 5.6615 1.5021 2.6565 2.4241 2.2293 1.9677 5.4394 3.6952 2.6838 2.6873 2.9903 3.0568 1.9956 2.6772 3.8388 1.2535 1.5018 1.4259 1.6507 2.0711 1.3865 1.4984 1.5672 1.4107 1.2273 1.2650 1.7784 1.5185 1.3196 2.5602 2.3838 1.9520 1.2078 1.1204 1.0498 1.0901 1.0539 1.0785 1.0957 1.3727 9.1003 3.4127 1.0793 1.0651 1.0622 1.0621 1.0296 1.0614 1.0928 1.1010 1.1013 1.1021 1.1052 1.1049 1.0456 1.0638 1.1002
irintensity: 0.6488 0.1927 0.3863 1.4467 1.9949 0.2373 1.9567 0.9686 0.6461 5.0359 2.9853 2.6974 19.2321 4.0881 8.7462 7.3355 25.2326 3.9899 9.4843 5.8522 9.0420 3.6843 17.9594 229.0268 32.7856 6.1758 10.7053 107.5055 54.9356 22.6614 4.7587 34.9256 47.3068 11.2204 35.0678 87.7534 3.9335 77.3991 51.9958 24.0449 182.6253 57.4551 37.7874 27.1551 147.8473 0.0867 6.0236 25.8136 14.2991 15.0263 58.9097 43.1887 73.3099 20.8688 5.4161 15.4303 92.0087 66.3079 6.5561 112.9544 36.0146 16.1813 46.9342 34.3852 15.1700 3.0339 10.6865 1.6002 13.2959 205.4354 182.6782 162.1312 55.4332 9.2898 11.2923 54.5296 30.8814 17.0555 17.8010 1.5228 47.8059 3.2617 23.9799 11.4639 12.5390 25.6365 15.4484
temp: 298.150 k
press: 1.00000 atm
elementType: 8 8 8 8 8 7 7 7 6 6 6 6 6 6 6 6 1 1 1 1 1 1 1 1 1 1 1 1 1 1 1
symmnumber: 1
zpe: 635317.4 jmol-1
zpe.correction: 0.241980 hartree
zpe.thermalcorrener: 0.260693 hartree
zpe.thermalcorrenthalpy: 0.261637 hartree
zpe.thermalcorrgfe: 0.191741 hartree
zpe.sumelectzpe: -852.884370 hartree
zpe.sumelectthermal: -852.865657 hartree
zpe.sumelectthermalent: -852.864713 hartree
zpe.sumelectthermalfe: -852.934609 hartree
dipole: -0.4631 1.8102 -2.8218
dipole: 3.3844
quadrupole: -104.2009 -84.4620 -99.3455
quadrupole: -9.1980 -1.9982 8.2315
quadrupole: -8.1981 11.5409 -3.3427 -9.1980 -1.9982 8.2315
hfenergy: -853.12635 hartree
pointgroup: C01 [X(C8H15N3O5)]
dipole: -0.0754065 0.7381734 -1.1056142 debye
polarizability: 131.7638418|-4.1481543|132.5981396|-7.5512173|-1.512334|115.826104 unknown
InChI: InChI=1S/C8H15N3O5/c1-16-8(14)11(10-15)5-3-2-4-6(9)7(12)13/h6,12H,2-5,9H2,1H3
charge 0 multiplicity 1
31 atoms
O  2.204457 1.291924 1.101222
O  4.493224 1.021135 1.317333
O  -2.819977 1.78576 0.163164
O  -1.915376 1.017449 -1.85285
O  -2.813009 -1.792155 1.672666
N  -2.288561 -0.466513 -0.068923
N  4.602583 -0.895921 -0.614095
N  -2.868132 -0.599091 1.232724
C  0.746202 -0.864043 -0.559828
C  2.176198 -1.331531 -0.21582
C  -0.285375 -1.993322 -0.343595
C  3.296483 -0.262309 -0.430592
C  -1.720638 -1.631569 -0.7955
C  3.42697 0.71704 0.736802
C  -2.313164 0.817843 -0.680547
C  -2.891184 3.144497 -0.433058
H  0.71005 -0.526082 -1.616162
H  0.486378 0.011817 0.060733
H  2.448257 -2.187074 -0.865049
H  2.230592 -1.707794 0.823584
H  -0.300819 -2.298161 0.719637
H  0.012741 -2.889308 -0.925345
H  2.980314 0.36817 -1.301415
H  -2.397602 -2.484056 -0.605105
H  -1.741611 -1.374188 -1.866767
H  4.769724 -1.326639 -1.52237
H  5.395914 -0.402572 -0.19952
H  2.359243 1.924338 1.854925
H  -1.88384 3.487817 -0.721268
H  -3.312243 3.767936 0.366996
H  -3.545201 3.137704 -1.320677
