program: Gaussian 09
title: 000056134
version: EM64L-G09RevD.01
frameworkgroup: C1[X(C10H22N2)]
method: RPBEPBE
basis: SDD
operation: Freq
keyword: #pfreq=noraman
keyword: PBEPBE/SDD
title: #p freq=noraman PBEPBE/SDD
converged: YES YES NO NO
title: Mulliken charges:
elementType: N N C C C C C C C C C C H H H H H H H H H H H H H H H H H H H H H H
charge: -0.641758 -0.615212 0.043857 -0.559766 -0.096572 0.016393 -0.494761 0.285790 -0.430927 -0.777176 -0.753249 -0.775926 0.213681 0.202923 0.242881 0.186475 0.185974 0.201011 0.189660 0.181059 0.214313 0.211157 0.217626 0.211699 0.204291 0.211242 0.215559 0.244073 0.201283 0.213052 0.267185 0.264212 0.258159 0.261794
chargesum: 0.00000
title: Mulliken charges with hydrogens summed into heavy atoms:
elementType: N N C C C C C C C C C C
charge: -0.110360 -0.095259 0.257538 -0.113963 0.089903 0.202367 -0.104090 0.285790 -0.035555 -0.136695 -0.122157 -0.117519
polarizability: 1.40077217e+02 -2.91593846e+00 1.13399743e+02 8.51900802e-01 -1.40664968e-01 1.05604878e+02
1716.lowfreq: -7.8514 -0.0002 0.0006 0.0007 8.1080 24.0024 48.9505 73.8593 142.2054
frequency: 48.6111 73.7333 142.1966 172.7441 203.0357 209.6927 218.3094 239.8153 247.1934 260.1841 272.2163 279.5672 306.3224 319.3260 347.6537 365.0534 391.1832 446.9877 457.0048 489.7804 527.9893 561.0623 595.8594 667.1530 684.5070 745.5596 790.0237 822.8880 867.0532 881.7928 906.9776 923.8186 940.1505 952.1366 954.7769 982.1518 1003.3344 1022.4466 1041.6520 1049.2901 1079.3099 1096.7189 1098.0254 1133.9889 1159.6438 1169.3204 1192.2288 1237.7923 1241.7058 1251.9004 1284.0025 1291.3895 1307.6517 1311.6064 1316.3008 1339.2263 1340.5757 1349.1750 1366.1367 1367.8613 1376.1720 1383.3051 1387.7329 1455.3807 1458.8737 1463.5351 1465.2372 1470.1985 1471.7048 1478.5436 1487.7569 1493.1023 1633.6133 1637.9747 2843.3793 2951.6461 2952.7281 2962.3526 2964.3890 2972.8246 2974.2540 2978.3064 2978.7765 3025.3871 3037.3695 3042.0523 3054.9771 3055.5994 3061.2274 3064.3285 3072.0653 3096.4469 3424.1107 3441.7535 3547.8164 3565.1601
redmass: 2.7315 3.0411 2.8999 1.9004 1.1784 1.4384 1.3691 1.4519 2.2283 1.1973 1.2045 2.3593 2.5751 2.0137 2.3529 2.3363 2.1068 2.3961 2.6711 2.2417 2.4922 2.3440 1.7184 1.6410 2.0106 3.1342 2.0761 2.1636 2.2153 1.5692 1.5723 1.9127 1.8178 2.0066 1.6335 1.3814 1.4602 1.8996 1.6735 1.6548 1.5436 1.8656 1.7400 1.9882 1.9488 1.9875 1.6979 1.5480 1.9508 1.3098 1.5308 1.6379 1.4444 1.4802 1.2653 1.4986 1.4795 1.7635 1.3359 1.2643 1.3272 1.2454 1.4154 1.0646 1.0840 1.0740 1.0554 1.0719 1.0516 1.0691 1.0552 1.0575 1.0959 1.0954 1.0821 1.0735 1.0707 1.0372 1.0362 1.0638 1.0427 1.0577 1.0760 1.0969 1.1013 1.0997 1.0989 1.0990 1.0986 1.0968 1.0977 1.0988 1.0447 1.0448 1.0959 1.0965
irintensity: 0.7505 0.7282 1.5580 7.8812 31.1931 0.3741 4.4923 12.7821 14.4884 4.5878 48.2822 2.8025 2.0346 0.8236 1.4007 3.7888 0.3759 6.0527 3.8030 0.8457 4.2827 35.7418 62.8666 159.6698 58.9756 13.0218 0.8987 0.4523 1.0074 1.6966 0.6593 0.5760 2.7261 8.4568 5.8096 0.2189 12.4539 8.2683 8.3642 3.8459 0.4410 3.4649 0.7659 6.7151 7.1157 7.5993 17.7905 8.1319 11.6539 3.3347 13.4892 10.7078 12.6413 3.9964 2.9476 2.0468 1.1365 1.8325 21.2676 15.6760 10.2794 10.9681 11.9411 4.7423 8.2631 0.9961 2.2329 3.5998 16.4498 9.9707 12.0536 13.8729 66.7231 52.1287 112.1171 8.9503 51.4849 38.4531 27.3973 79.4303 16.5725 32.2181 31.5803 38.2141 7.6965 58.9771 8.1912 54.7922 53.1112 85.2078 43.4524 28.3376 4.7907 3.0991 0.5177 0.1039
temp: 298.150 k
press: 1.00000 atm
elementType: 7 7 6 6 6 6 6 6 6 6 6 6 1 1 1 1 1 1 1 1 1 1 1 1 1 1 1 1 1 1 1 1 1 1
symmnumber: 1
zpe: 813914.5 jmol-1
zpe.correction: 0.310004 hartree
zpe.thermalcorrener: 0.324262 hartree
zpe.thermalcorrenthalpy: 0.325206 hartree
zpe.thermalcorrgfe: 0.270931 hartree
zpe.sumelectzpe: -502.752062 hartree
zpe.sumelectthermal: -502.737803 hartree
zpe.sumelectthermalent: -502.736859 hartree
zpe.sumelectthermalfe: -502.791134 hartree
dipole: -0.4451 0.3149 0.0006
dipole: 0.5452
quadrupole: -71.2932 -72.6874 -80.3120
quadrupole: 3.3035 -0.4731 -2.8202
quadrupole: 3.4710 2.0768 -5.5478 3.3035 -0.4731 -2.8202
hfenergy: -503.0620655 hartree
pointgroup: C01 [X(C10H22N2)]
dipole: 0.1750297 -0.1239513 -0.0035414 debye
polarizability: 140.0729988|-2.9059716|113.3879758|-0.9483456|0.375679|105.6208642 unknown
InChI: InChI=1S/C10H22N2/c1-7-4-5-8(6-9(7)11)10(2,3)12/h7-9H,4-6,11-12H2,1-3H3
charge 0 multiplicity 1
34 atoms
N  -1.88908 -1.554765 -0.997196
N  2.477496 0.482751 1.38507
C  0.66142 0.013147 -0.27064
C  -0.113111 -0.985591 0.626635
C  -1.638779 -1.000509 0.358053
C  -2.241146 0.428252 0.486711
C  0.036902 1.426774 -0.107848
C  2.21235 -0.003249 -0.00207
C  -1.477433 1.420415 -0.42037
C  -3.761235 0.454333 0.215788
C  2.945105 0.867841 -1.070958
C  2.779127 -1.443009 -0.090592
H  0.517774 -0.29239 -1.328315
H  0.271484 -2.014914 0.482547
H  0.073591 -0.721733 1.685618
H  -2.110684 -1.629228 1.155943
H  -2.074564 0.731556 1.543852
H  0.540442 2.156426 -0.770104
H  0.181722 1.772451 0.937992
H  -1.896371 2.439376 -0.295235
H  -1.632627 1.122395 -1.475825
H  -4.297556 -0.292468 0.833201
H  -4.186253 1.448809 0.447364
H  -3.980012 0.247622 -0.849349
H  4.040203 0.81103 -0.92024
H  2.723163 0.523871 -2.099819
H  2.652605 1.931095 -0.999025
H  2.415779 -2.064505 0.744592
H  3.885633 -1.424188 -0.043391
H  2.491306 -1.922737 -1.043589
H  -2.881944 -1.688706 -1.215727
H  -1.348875 -2.406327 -1.186553
H  2.256509 1.477845 1.511598
H  3.435261 0.280929 1.697881
