program: Gaussian 09
title: 000056183
version: EM64L-G09RevD.01
frameworkgroup: C1[X(C15H17NO5)]
method: RPBEPBE
basis: SDD
operation: Freq
keyword: #p
keyword: freq=noraman
keyword: PBEPBE/SDD
title: #p freq=noraman PBEPBE/SDD
converged: YES YES NO NO
title: Mulliken charges:
elementType: O O O O O N C C C C C C C C C C C C C C C H H H H H H H H H H H H H H H H H
charge: -0.236949 -0.252125 -0.247522 -0.231333 -0.226410 -0.246040 -0.186507 0.370292 0.142936 0.201690 -0.425335 -0.693879 -0.443585 0.216405 0.327809 -0.339166 -0.385995 0.095355 -0.222937 -0.787091 -0.671789 0.294226 0.243424 0.268358 0.249479 0.241692 0.236947 0.271491 0.261251 0.286828 0.226310 0.235737 0.237953 0.241544 0.262929 0.216730 0.236148 0.231129
chargesum: 0.00000
title: Mulliken charges with hydrogens summed into heavy atoms:
elementType: O O O O O N C C C C C C C C C C C C C C C
charge: -0.236949 -0.252125 -0.247522 -0.231333 -0.226410 -0.246040 0.107719 0.370292 0.142936 0.201690 0.086447 0.034239 -0.172094 0.216405 0.327809 -0.077915 -0.099167 0.095355 0.239111 -0.044665 0.012218
polarizability: 2.33471034e+02 -2.61332091e+01 1.95246920e+02 -8.69726229e+00 -1.76889089e+01 1.39200693e+02
1716.lowfreq: -5.3043 0.0006 0.0007 0.0008 3.0934 7.0842 21.0104 33.2829 43.1716
frequency: 20.9319 33.2353 43.1382 56.5380 60.5179 67.6264 103.6876 110.8703 121.5295 140.4925 153.5938 162.3399 164.6726 181.9056 221.4511 233.6855 247.7235 298.8437 306.4195 326.1589 328.4650 351.1589 384.8215 437.6969 440.5372 450.1876 486.3929 492.7883 516.1440 534.8567 547.5327 583.6321 610.4061 643.4405 655.7905 698.5226 717.2498 738.2839 746.2309 798.3267 804.7589 827.8761 850.1134 868.4833 894.0281 944.0971 958.8449 967.7470 984.2406 999.0240 1011.6008 1020.6422 1023.1252 1058.0355 1079.3814 1094.5531 1111.6583 1120.1921 1135.0819 1139.6512 1180.3351 1200.8175 1209.5217 1247.3325 1249.8929 1277.4849 1296.6743 1315.7056 1320.8646 1341.4786 1355.4524 1363.2121 1371.8501 1392.6979 1398.9383 1402.9269 1434.0486 1446.9942 1452.2589 1463.3746 1463.9461 1468.9025 1472.6275 1477.7457 1486.0449 1497.5269 1566.1891 1597.7212 1604.8087 1620.4283 1624.0960 2973.7737 2977.2975 2984.7440 2998.6069 3010.7254 3011.0540 3066.9514 3071.1096 3095.6791 3110.6454 3110.7628 3114.8332 3126.3938 3131.8447 3158.5375 3173.7843 3177.6257
redmass: 3.7460 3.8030 3.5359 5.6720 4.4108 5.7508 4.9688 3.8458 2.9342 2.5800 1.0683 3.1563 1.1781 3.3031 4.4885 3.4769 1.3340 5.2390 6.6652 5.5606 6.2620 4.6305 4.0141 3.7533 6.0063 3.9667 5.3127 3.8694 4.1661 5.4857 4.5838 4.6139 4.2214 3.3729 5.3272 5.0341 5.9544 4.7072 4.1020 1.1132 3.6348 4.3889 1.4161 4.3902 1.4255 2.6424 3.4675 2.3133 1.3423 4.4490 2.1427 2.3612 1.8445 2.1576 2.1190 2.3732 2.3525 1.9344 1.4642 1.9375 3.3781 2.9862 1.1725 2.2675 1.1614 1.8017 2.1943 4.8726 1.3914 1.3846 1.3964 1.5492 1.4196 7.4332 1.2046 1.2592 3.3125 1.1082 1.1591 1.0402 1.0487 1.0574 1.0651 1.0562 1.0656 3.0365 7.5092 8.4655 8.4062 7.9409 10.0708 1.0807 1.0687 1.0380 1.0359 1.0463 1.0473 1.0966 1.1068 1.0986 1.1018 1.1018 1.0998 1.0990 1.0952 1.0882 1.0914 1.0965
irintensity: 0.6115 1.0178 0.8345 5.3256 1.5728 0.1896 1.8924 0.9329 3.5750 1.7863 0.1057 12.0491 1.1573 4.4568 8.4631 2.6891 1.1205 0.3800 9.2457 4.5861 6.6104 2.6732 1.9884 2.7052 3.8800 3.4494 10.9737 0.7415 1.2569 44.0427 2.7743 9.0540 5.1213 13.9839 3.5759 1.5008 7.2218 10.0600 3.0919 3.3124 5.1906 10.2190 45.2416 10.7041 19.6441 39.8968 11.2446 1.5557 0.8631 16.0517 17.9576 47.9829 1.5459 46.0082 15.9440 102.7906 18.3344 58.5241 9.8366 38.1905 150.7398 66.4416 18.3463 93.1347 3.2089 173.3469 201.4592 90.9837 11.9566 17.3927 4.1668 36.3999 69.2477 7.8970 31.6791 17.9499 63.1872 62.2260 20.1576 13.2970 22.6413 4.4920 4.6047 5.1818 13.8724 37.4955 142.8910 336.9005 15.8223 73.9616 257.6694 38.7287 38.4915 3.3959 16.1545 17.5096 10.8468 11.9232 7.9684 25.2571 9.4201 38.3900 16.8089 17.3138 3.4569 0.3842 3.8939 3.3051
temp: 298.150 k
press: 1.00000 atm
elementType: 8 8 8 8 8 7 6 6 6 6 6 6 6 6 6 6 6 6 6 6 6 1 1 1 1 1 1 1 1 1 1 1 1 1 1 1 1 1
symmnumber: 1
zpe: 777615.9 jmol-1
zpe.correction: 0.296178 hartree
zpe.thermalcorrener: 0.317169 hartree
zpe.thermalcorrenthalpy: 0.318113 hartree
zpe.thermalcorrgfe: 0.244776 hartree
zpe.sumelectzpe: -1011.124135 hartree
zpe.sumelectthermal: -1011.103144 hartree
zpe.sumelectthermalent: -1011.102200 hartree
zpe.sumelectthermalfe: -1011.175537 hartree
dipole: -2.4840 -0.8559 -1.5342
dipole: 3.0425
quadrupole: -149.7174 -119.8368 -115.8268
quadrupole: 7.2606 8.0276 2.4447
quadrupole: -21.2571 8.6236 12.6335 7.2606 8.0276 2.4447
hfenergy: -1011.4203131 hartree
pointgroup: C01 [X(C15H17N1O5)]
dipole: -0.8205604 -0.4973952 -0.7156155 debye
polarizability: 242.4914345|-14.2286809|188.2597977|4.6597405|-17.9276512|137.1674146 unknown
InChI: InChI=1S/C15H17NO5/c1-4-20-15(19)9(2)16-12-7-11(10(3)17)5-6-13(12)21-8-14(16)18/h5-7,9H,4,8H2,1-3H3
charge 0 multiplicity 1
38 atoms
O  -0.835427 3.120786 -0.462631
O  -1.442275 -1.916883 -0.878269
O  -3.608746 0.88995 0.279028
O  -0.596324 -3.021106 0.99102
O  4.841566 0.159638 0.105873
N  -1.308169 0.488053 0.478864
C  -1.594068 -0.760215 1.234148
C  0.029897 0.908547 0.183759
C  0.242757 2.243225 -0.27206
C  -2.413345 1.223921 0.036098
C  -2.097933 2.445258 -0.823784
C  -1.095247 -0.729426 2.689613
C  1.157293 0.079515 0.3748
C  -1.132826 -2.015865 0.468978
C  2.469913 0.564532 0.139612
C  1.542491 2.740514 -0.494137
C  2.653496 1.907205 -0.288252
C  3.68274 -0.299943 0.33441
C  -1.109102 -3.10738 -1.728781
C  3.50056 -1.737382 0.812888
C  -1.529655 -2.760612 -3.151894
H  -2.703421 -0.80743 1.240896
H  -2.058068 2.137446 -1.889198
H  -2.893478 3.190579 -0.687837
H  -1.34444 -1.682999 3.183305
H  -0.005101 -0.587499 2.762273
H  -1.592751 0.09313 3.230292
H  1.027413 -0.947548 0.723172
H  1.650236 3.775857 -0.830074
H  3.674321 2.262205 -0.45825
H  -0.024896 -3.301359 -1.638241
H  -1.652401 -3.978867 -1.321492
H  2.868078 -2.319292 0.116673
H  3.009594 -1.770877 1.803685
H  4.488266 -2.216425 0.886758
H  -1.313111 -3.612642 -3.821564
H  -2.610398 -2.545459 -3.201959
H  -0.979139 -1.87955 -3.523022
