program: Orca
programVersion: 5.0.2
elementType: S S P O O O N C C C C C C C C C C C C C C H H H H H H H H H H H H H H H H H H H H H H H H H H H H
charge: 0
multiplicity: 1
keywords: wb97x-d3
keywords: def2-TZVPP
keywords: def2/J RIJCOSX
keywords: DEFGRID2
keywords: scfconv7
keywords: smallprint printgap noloewdin
keywords: NOSOSCF
formula: C14H28NO3PS2
InChI: InChI=1/C14H28NO3PS2/c1-4-10-17-19(20,18-11-5-2)21-12-14(16)15-9-7-6-8-13(15)3/h13H,4-12H2,1-3H3
49 atoms
S  -0.34071 -1.812469 -0.032446
S  2.135514 -0.844239 -2.176384
P  1.469087 -0.836407 -0.369184
O  -1.210118 1.169957 -1.976353
O  1.198183 0.59046 0.291045
O  2.366511 -1.547799 0.74588
N  -2.478129 0.759976 -0.150967
C  -3.145167 -0.142352 0.790267
C  -4.659724 0.068466 0.704621
C  -5.062095 1.526726 0.885537
C  -4.294708 2.411565 -0.08814
C  -2.797111 2.171689 0.029293
C  -2.60075 0.022802 2.205739
C  -1.6909 0.378547 -1.17222
C  -1.374481 -1.098235 -1.352146
C  2.105663 1.702639 0.130741
C  3.187774 -2.705553 0.503797
C  1.315345 2.989724 0.168965
C  4.603469 -2.434884 0.960725
C  0.595091 3.23987 1.484755
C  5.297638 -1.317984 0.196851
H  -2.950078 -1.168204 0.48654
H  -5.002856 -0.282341 -0.27345
H  -5.14469 -0.563504 1.45236
H  -6.138192 1.635405 0.734864
H  -4.861619 1.850566 1.911282
H  -4.498903 3.467214 0.102959
H  -4.613947 2.206168 -1.114263
H  -2.446853 2.493255 1.014034
H  -2.252815 2.757253 -0.705115
H  -1.518579 -0.107847 2.22345
H  -3.037458 -0.736433 2.855927
H  -2.83066 0.994938 2.641705
H  -0.856282 -1.218994 -2.302319
H  -2.269783 -1.719998 -1.391855
H  2.640395 1.611945 -0.817351
H  2.837462 1.66354 0.941345
H  2.748421 -3.533294 1.062182
H  3.169937 -2.967076 -0.557004
H  0.609164 3.000386 -0.664761
H  2.026127 3.798218 -0.020498
H  5.154381 -3.370591 0.832563
H  4.609336 -2.222872 2.033185
H  -0.123196 2.452943 1.717967
H  1.299863 3.300689 2.316593
H  0.045858 4.181419 1.451071
H  5.310197 -1.515272 -0.876222
H  6.332407 -1.213468 0.524868
H  4.812349 -0.353308 0.350317
elementType: S P O N C H
totalener: -1968.78804440 hartree
nucrepener: 2462.82258269 hartree
electener: -4431.61062710 hartree
oneelecener: -7606.11463696 hartree
twoeener: 3174.50400986 hartree
cpcmener: -0.03019569 hartree
kineticenergy: 1962.77296846 hartree
xcener: -137.074589583226 hartree
chargesum: -0.0000000
charge: -0.164764 -0.439937 0.643853 -0.519243 -0.325493 -0.362532 -0.041053 0.023370 -0.146773 -0.122659 -0.128797 -0.119123 -0.293812 0.240318 -0.099250 0.003138 0.013998 -0.096593 -0.074149 -0.266407 -0.265417 0.088674 0.078025 0.079687 0.078177 0.076074 0.076338 0.073568 0.104612 0.104836 0.082517 0.103756 0.098531 0.136040 0.152060 0.102646 0.111252 0.112715 0.093332 0.063339 0.082581 0.065948 0.066209 0.068582 0.093666 0.097781 0.078776 0.097765 0.073835
qa: -0.1648 -0.4399 0.6439 -0.5192 -0.3255 -0.3625 -0.0411 0.0234 -0.1468 -0.1227 -0.1288 -0.1191 -0.2938 0.2403 -0.0993 0.0031 0.0140 -0.0966 -0.0741 -0.2664 -0.2654 0.0887 0.0780 0.0797 0.0782 0.0761 0.0763 0.0736 0.1046 0.1048 0.0825 0.1038 0.0985 0.1360 0.1521 0.1026 0.1113 0.1127 0.0933 0.0633 0.0826 0.0659 0.0662 0.0686 0.0937 0.0978 0.0788 0.0978 0.0738
va: 2.2869 2.0098 5.4447 1.9744 2.1087 2.0942 3.0988 3.9488 3.9308 3.8782 3.9347 3.8784 3.9274 4.1312 3.8133 3.8509 3.8510 3.8900 3.8823 3.9266 3.9372 1.0062 1.0152 1.0133 1.0125 1.0066 1.0147 1.0132 0.9932 1.0358 1.0262 1.0083 0.9977 1.0422 0.9978 1.0156 0.9952 1.0015 1.0154 1.0281 1.0136 1.0134 1.0127 0.9973 1.0055 1.0039 1.0073 1.0078 1.0054
dispcorr: -0.028727416 hartree
energy: -1968.816771819984
dipole: -7.62446 6.51384 -1.11062 14.42595 -14.89396 -0.46802 16.60858 -14.29575 2.31283
magnitude: 2.60800 au
magnitude: 6.62902 debye
