program: Orca
programVersion: 5.0.2
elementType: S S P O O O N C C C C C C C C C C C C C C H H H H H H H H H H H H H H H H H H H H H H H H H H H H
charge: 0
multiplicity: 1
keywords: wb97x-d3
keywords: def2-TZVPP
keywords: def2/J RIJCOSX
keywords: DEFGRID2
keywords: scfconv7
keywords: smallprint printgap noloewdin
keywords: NOSOSCF
formula: C14H28NO3PS2
InChI: InChI=1/C14H28NO3PS2/c1-4-10-17-19(20,18-11-5-2)21-12-14(16)15-9-7-6-8-13(15)3/h13H,4-12H2,1-3H3
49 atoms
S  -0.337988 1.528365 0.735672
S  1.971225 1.280245 -1.766865
P  1.241969 0.501031 -0.164474
O  -1.65994 0.071449 -2.278808
O  2.19758 0.405246 1.11599
O  0.716537 -1.000777 -0.254307
N  -2.964767 -0.159138 -0.447418
C  -3.482214 0.298228 0.844857
C  -3.181287 -0.75391 1.914116
C  -3.668218 -2.143849 1.525144
C  -3.122675 -2.528397 0.156648
C  -3.455994 -1.463356 -0.876971
C  -4.961509 0.65642 0.755959
C  -2.053938 0.48864 -1.194428
C  -1.463235 1.787656 -0.673511
C  3.024272 1.511988 1.526817
C  0.926676 -1.896035 -1.366625
C  4.474036 1.269141 1.171327
C  1.985708 -2.929837 -1.057568
C  5.349207 2.402357 1.685041
C  3.390675 -2.373221 -0.889892
H  -2.956784 1.206645 1.128136
H  -2.098997 -0.782209 2.070888
H  -3.629459 -0.435468 2.858162
H  -3.355899 -2.869602 2.279028
H  -4.761957 -2.173198 1.505388
H  -3.535754 -3.484287 -0.172858
H  -2.035856 -2.650193 0.208417
H  -4.538495 -1.409323 -1.02434
H  -3.020449 -1.706232 -1.841377
H  -5.291756 1.080709 1.704955
H  -5.600736 -0.200229 0.542546
H  -5.133055 1.405021 -0.018831
H  -2.215319 2.498931 -0.329637
H  -0.910577 2.262818 -1.482765
H  2.89461 1.596483 2.606819
H  2.672093 2.446467 1.080181
H  -0.036169 -2.375138 -1.541364
H  1.185561 -1.32456 -2.260436
H  4.572852 1.181607 0.087021
H  4.801237 0.32034 1.603789
H  1.968999 -3.635555 -1.892953
H  1.694892 -3.501599 -0.172374
H  5.29944 2.485053 2.772349
H  6.392941 2.240835 1.415793
H  5.047757 3.363706 1.264814
H  4.111588 -3.183749 -0.777698
H  3.481384 -1.743255 -0.005199
H  3.693066 -1.78145 -1.755429
elementType: S P O N C H
totalener: -1968.78702954 hartree
nucrepener: 2464.22886553 hartree
electener: -4433.01589506 hartree
oneelecener: -7608.83849801 hartree
twoeener: 3175.82260294 hartree
cpcmener: -0.02850267 hartree
kineticenergy: 1962.77512846 hartree
xcener: -137.076709274154 hartree
chargesum: -0.0000000
charge: -0.176937 -0.436183 0.649354 -0.519268 -0.356993 -0.348548 -0.047942 -0.004343 -0.125466 -0.112591 -0.126431 -0.116911 -0.289080 0.242685 -0.088933 0.025009 0.021611 -0.084347 -0.079760 -0.269277 -0.265205 0.090505 0.069414 0.080342 0.077618 0.075816 0.077793 0.067630 0.114333 0.102355 0.095998 0.090667 0.097317 0.152555 0.132417 0.112203 0.090033 0.101246 0.111070 0.057436 0.068825 0.069178 0.065167 0.083416 0.093630 0.084769 0.097446 0.070194 0.080185
qa: -0.1769 -0.4362 0.6494 -0.5193 -0.3570 -0.3485 -0.0479 -0.0043 -0.1255 -0.1126 -0.1264 -0.1169 -0.2891 0.2427 -0.0889 0.0250 0.0216 -0.0843 -0.0798 -0.2693 -0.2652 0.0905 0.0694 0.0803 0.0776 0.0758 0.0778 0.0676 0.1143 0.1024 0.0960 0.0907 0.0973 0.1526 0.1324 0.1122 0.0900 0.1012 0.1111 0.0574 0.0688 0.0692 0.0652 0.0834 0.0936 0.0848 0.0974 0.0702 0.0802
va: 2.2792 2.0045 5.4388 1.9770 2.1007 2.0910 3.1230 3.9824 3.8901 3.8708 3.9106 3.8635 3.9556 4.1451 3.8047 3.8486 3.8163 3.8788 3.9146 3.9593 3.9210 1.0069 1.0325 1.0150 1.0125 1.0072 1.0163 1.0158 0.9971 1.0421 1.0043 1.0013 1.0086 1.0012 1.0444 0.9970 1.0116 0.9981 1.0206 1.0256 1.0092 1.0117 1.0118 1.0021 1.0032 1.0009 1.0080 1.0155 1.0084
dispcorr: -0.028163638 hartree
energy: -1968.815193177809
dipole: -1.88536 0.59823 -1.28713 -12.12985 11.74406 -0.38580 10.46460 -8.29203 2.17257
magnitude: 2.55453 au
magnitude: 6.49309 debye
