program: Orca
programVersion: 5.0.2
elementType: S S P O O O N C C C C C C C C C C C C C C H H H H H H H H H H H H H H H H H H H H H H H H H H H H
charge: 0
multiplicity: 1
keywords: wb97x-d3
keywords: def2-TZVPP
keywords: def2/J RIJCOSX
keywords: DEFGRID2
keywords: scfconv7
keywords: smallprint printgap noloewdin
keywords: NOSOSCF
formula: C14H28NO3PS2
InChI: InChI=1/C14H28NO3PS2/c1-4-10-17-19(20,18-11-5-2)21-12-14(16)15-9-7-6-8-13(15)3/h13H,4-12H2,1-3H3
49 atoms
S  -0.42761 1.561841 0.962704
S  1.92653 1.800197 -1.488997
P  1.216489 0.755936 -0.043857
O  -1.630203 0.328053 -2.225305
O  2.168009 0.510504 1.224314
O  0.749586 -0.733909 -0.370329
N  -2.892646 -0.216555 -0.430759
C  -3.40357 0.023808 0.915033
C  -2.939302 -1.096843 1.849908
C  -3.27306 -2.483103 1.310271
C  -2.735432 -2.63871 -0.106795
C  -3.235791 -1.511251 -0.999626
C  -4.919121 0.210622 0.913586
C  -2.036453 0.587227 -1.109179
C  -1.550457 1.867242 -0.441565
C  3.068897 1.512996 1.710123
C  1.079731 -1.396745 -1.603605
C  4.452783 0.923219 1.882632
C  2.492991 -1.938721 -1.605884
C  5.065139 0.411544 0.586843
C  2.801069 -2.880535 -0.451304
H  -2.972619 0.949346 1.290794
H  -1.856423 -1.006681 1.97042
H  -3.382876 -0.948003 2.837441
H  -2.851426 -3.246744 1.966579
H  -4.355727 -2.644664 1.313212
H  -3.034243 -3.599239 -0.53275
H  -1.641708 -2.619463 -0.08989
H  -4.321732 -1.582013 -1.119163
H  -2.804438 -1.57313 -1.994356
H  -5.458514 -0.687307 0.613502
H  -5.210393 1.013422 0.235996
H  -5.26191 0.474835 1.914266
H  -2.359826 2.481338 -0.043741
H  -1.020727 2.452524 -1.192305
H  2.677568 1.875801 2.662942
H  3.10602 2.35702 1.015363
H  0.350154 -2.203779 -1.682044
H  0.916912 -0.715682 -2.439527
H  4.424538 0.125394 2.629027
H  5.08034 1.713221 2.304884
H  3.199537 -1.104772 -1.621432
H  2.628098 -2.459254 -2.558328
H  6.099303 0.105359 0.741912
H  4.524038 -0.452851 0.204223
H  5.053781 1.176461 -0.190215
H  2.115061 -3.729408 -0.435509
H  2.724165 -2.375593 0.511025
H  3.812275 -3.278747 -0.534363
totalener: -1968.75914570 hartree
nucrepener: 2496.00228036 hartree
electener: -4464.76142606 hartree
oneelecener: -7671.50650646 hartree
twoeener: 3206.74508039 hartree
kineticenergy: 1962.82664355 hartree
xcener: -137.082592270811 hartree
chargesum: 0.0000000
charge: -0.173824 -0.374944 0.623784 -0.402752 -0.340829 -0.326185 -0.055958 -0.039325 -0.118462 -0.121954 -0.119577 -0.124684 -0.262022 0.211142 -0.118586 -0.012357 0.011287 -0.078427 -0.111312 -0.244652 -0.244903 0.077567 0.078413 0.071564 0.077838 0.069133 0.074503 0.065787 0.100020 0.109931 0.079694 0.094594 0.087074 0.130234 0.148051 0.100066 0.094211 0.086261 0.132533 0.064418 0.060951 0.062426 0.072617 0.090356 0.062329 0.085887 0.076619 0.079289 0.092173
qa: -0.1738 -0.3749 0.6238 -0.4028 -0.3408 -0.3262 -0.0560 -0.0393 -0.1185 -0.1220 -0.1196 -0.1247 -0.2620 0.2111 -0.1186 -0.0124 0.0113 -0.0784 -0.1113 -0.2447 -0.2449 0.0776 0.0784 0.0716 0.0778 0.0691 0.0745 0.0658 0.1000 0.1099 0.0797 0.0946 0.0871 0.1302 0.1481 0.1001 0.0942 0.0863 0.1325 0.0644 0.0610 0.0624 0.0726 0.0904 0.0623 0.0859 0.0766 0.0793 0.0922
va: 2.2731 2.0649 5.4489 2.0962 2.1038 2.0945 3.0845 4.0279 3.8787 3.8791 3.8942 3.8757 3.9441 4.1626 3.7974 3.8995 3.8254 3.8744 3.9031 3.9425 3.9066 1.0110 1.0378 1.0158 1.0139 1.0098 1.0161 1.0184 0.9991 1.0469 1.0058 1.0115 1.0077 1.0015 1.0404 1.0017 1.0185 0.9929 1.0186 1.0112 1.0139 1.0261 1.0161 1.0105 1.0067 1.0115 1.0088 1.0148 1.0038
dispcorr: -0.029590176 hartree
energy: -1968.788735875579
dipole: -1.27109 0.62790 -0.64319 -19.72810 19.11227 -0.61583 7.62512 -6.30037 1.32475
magnitude: 1.59621 au
magnitude: 4.05725 debye
