program: Orca
programVersion: 5.0.2
elementType: S S P O O O N C C C C C C C C C C C C C C H H H H H H H H H H H H H H H H H H H H H H H H H H H H
charge: 0
multiplicity: 1
keywords: wb97x-d3
keywords: def2-TZVPP
keywords: def2/J RIJCOSX
keywords: DEFGRID2
keywords: scfconv7
keywords: smallprint printgap noloewdin
keywords: NOSOSCF
formula: C14H28NO3PS2
InChI: InChI=1/C14H28NO3PS2/c1-4-10-17-19(20,18-11-5-2)21-12-14(16)15-9-7-6-8-13(15)3/h13H,4-12H2,1-3H3
49 atoms
S  0.212818 0.451203 1.814065
S  0.794051 0.301491 -1.577472
P  1.440129 -0.071647 0.196198
O  -1.342634 -2.381496 0.032953
O  2.757647 0.734284 0.631847
O  1.814683 -1.578588 0.542478
N  -2.492824 -0.435435 -0.026873
C  -2.938931 0.822236 0.564162
C  -4.465739 0.794901 0.699301
C  -5.16171 0.466015 -0.616982
C  -4.601767 -0.821311 -1.21036
C  -3.08487 -0.757462 -1.315732
C  -2.435426 2.033188 -0.215578
C  -1.624438 -1.307155 0.531202
C  -0.962457 -0.943619 1.855891
C  3.181842 1.937342 -0.013703
C  1.83496 -2.658556 -0.407761
C  2.379598 3.143768 0.430234
C  3.25509 -3.042058 -0.762656
C  2.9249 4.420515 -0.193533
C  4.040846 -1.941986 -1.461959
H  -2.522761 0.899866 1.56683
H  -4.735695 0.040444 1.444882
H  -4.80881 1.756987 1.087492
H  -6.238011 0.37739 -0.455456
H  -5.029301 1.286465 -1.328722
H  -5.025926 -1.006209 -2.199841
H  -4.879887 -1.673274 -0.58301
H  -2.784516 0.000497 -2.045646
H  -2.674326 -1.703113 -1.656265
H  -2.873083 2.108301 -1.210538
H  -1.353758 1.988981 -0.331369
H  -2.688171 2.947379 0.32261
H  -0.436264 -1.829635 2.201645
H  -1.688164 -0.66929 2.623721
H  3.126864 1.81829 -1.099072
H  4.231491 2.050449 0.261398
H  1.306906 -3.482231 0.069733
H  1.270375 -2.377407 -1.298789
H  2.402698 3.215785 1.520256
H  1.333484 3.01098 0.140932
H  3.183565 -3.91756 -1.414727
H  3.785585 -3.373436 0.133526
H  3.964367 4.593301 0.089877
H  2.880407 4.382583 -1.282746
H  2.350149 5.288124 0.127225
H  5.001669 -2.317172 -1.813623
H  4.246297 -1.108865 -0.790874
H  3.49778 -1.550589 -2.323034
totalener: -1968.75771281 hartree
nucrepener: 2486.27251036 hartree
electener: -4455.03022317 hartree
oneelecener: -7652.29120294 hartree
twoeener: 3197.26097977 hartree
kineticenergy: 1962.82494631 hartree
xcener: -137.084647267788 hartree
chargesum: 0.0000000
charge: -0.168919 -0.404153 0.671582 -0.412234 -0.339690 -0.336386 -0.046124 -0.025149 -0.133410 -0.126554 -0.132234 -0.100253 -0.235965 0.196184 -0.113488 0.017985 0.013673 -0.089087 -0.074408 -0.260342 -0.265587 0.075173 0.071760 0.073636 0.076298 0.071690 0.071869 0.071956 0.102006 0.105430 0.081813 0.070577 0.085295 0.145495 0.122787 0.094262 0.097089 0.099958 0.102516 0.072353 0.055825 0.060165 0.059569 0.076504 0.082995 0.088282 0.088149 0.077864 0.083243
qa: -0.1689 -0.4042 0.6716 -0.4122 -0.3397 -0.3364 -0.0461 -0.0251 -0.1334 -0.1266 -0.1322 -0.1003 -0.2360 0.1962 -0.1135 0.0180 0.0137 -0.0891 -0.0744 -0.2603 -0.2656 0.0752 0.0718 0.0736 0.0763 0.0717 0.0719 0.0720 0.1020 0.1054 0.0818 0.0706 0.0853 0.1455 0.1228 0.0943 0.0971 0.1000 0.1025 0.0724 0.0558 0.0602 0.0596 0.0765 0.0830 0.0883 0.0881 0.0779 0.0832
va: 2.2619 2.0232 5.4137 2.0812 2.1227 2.1486 3.1011 4.0161 3.9089 3.8730 3.9172 3.8561 3.9263 4.1864 3.8372 3.8619 3.8739 3.8810 3.8934 3.9638 3.9246 1.0101 1.0180 1.0147 1.0138 1.0092 1.0169 1.0138 1.0005 1.0490 1.0078 1.0441 1.0106 1.0235 0.9997 1.0127 0.9955 1.0088 1.0167 1.0093 1.0145 1.0122 1.0129 1.0042 1.0032 1.0049 1.0083 1.0126 1.0123
dispcorr: -0.028934560 hartree
energy: -1968.786647370404
dipole: -5.86615 5.41278 -0.45337 10.02528 -9.24401 0.78127 -7.81646 8.18932 0.37286
magnitude: 0.97721 au
magnitude: 2.48388 debye
