program: Orca
programVersion: 5.0.2
elementType: S S P O O O N C C C C C C C C C C C C C C H H H H H H H H H H H H H H H H H H H H H H H H H H H H
charge: 0
multiplicity: 1
keywords: wb97x-d3
keywords: def2-TZVPP
keywords: def2/J RIJCOSX
keywords: DEFGRID2
keywords: scfconv7
keywords: smallprint printgap noloewdin
keywords: NOSOSCF
formula: C14H28NO3PS2
InChI: InChI=1/C14H28NO3PS2/c1-4-10-17-19(20,18-11-5-2)21-12-14(16)15-9-7-6-8-13(15)3/h13H,4-12H2,1-3H3
49 atoms
S  0.204517 0.341594 1.497063
S  1.118247 0.217605 -1.787521
P  1.69426 0.410517 0.045275
O  -2.937582 2.014161 1.992647
O  2.467722 1.762174 0.395007
O  2.681291 -0.710756 0.620522
N  -3.001144 0.160096 0.693528
C  -2.43025 -0.730531 -0.314402
C  -3.282626 -0.674564 -1.585505
C  -4.75889 -0.93842 -1.31144
C  -5.270681 -0.008634 -0.217858
C  -4.3944 -0.096312 1.0251
C  -2.262567 -2.149415 0.222712
C  -2.395172 1.256234 1.214937
C  -0.961969 1.556254 0.787406
C  2.960658 2.705619 -0.565119
C  2.770161 -2.025725 0.056858
C  4.443069 2.541953 -0.827929
C  1.590047 -2.902608 0.421298
C  4.824563 1.233197 -1.505865
C  1.774157 -4.315253 -0.114846
H  -1.434447 -0.38013 -0.577733
H  -3.170395 0.317218 -2.034343
H  -2.888152 -1.389446 -2.311467
H  -5.337365 -0.806951 -2.228064
H  -4.907023 -1.979455 -1.007859
H  -6.301286 -0.253755 0.048144
H  -5.274647 1.024373 -0.577823
H  -4.482255 -1.090418 1.474675
H  -4.707847 0.621557 1.777324
H  -1.763329 -2.767822 -0.524385
H  -3.208549 -2.634108 0.46383
H  -1.647013 -2.144978 1.121735
H  -0.715757 2.54287 1.169548
H  -0.851728 1.56036 -0.299507
H  2.756351 3.686829 -0.135636
H  2.393754 2.618592 -1.496168
H  2.872535 -1.953601 -1.029543
H  3.696865 -2.439189 0.456232
H  4.997539 2.661014 0.105986
H  4.734497 3.38314 -1.463809
H  0.675557 -2.47168 0.008773
H  1.469194 -2.92249 1.506681
H  5.87342 1.245822 -1.801386
H  4.689345 0.381509 -0.84056
H  4.226593 1.055908 -2.400535
H  2.666366 -4.790019 0.296109
H  1.866181 -4.321032 -1.201802
H  0.922539 -4.942491 0.143678
totalener: -1968.75912647 hartree
nucrepener: 2436.13386964 hartree
electener: -4404.89299611 hartree
oneelecener: -7551.02998776 hartree
twoeener: 3146.13699165 hartree
kineticenergy: 1962.82590771 hartree
xcener: -137.085331459105 hartree
chargesum: -0.0000000
charge: -0.132082 -0.412776 0.653402 -0.400580 -0.323661 -0.336292 -0.100581 0.067751 -0.136015 -0.119610 -0.127085 -0.116614 -0.305784 0.236393 -0.100487 -0.004551 0.017538 -0.080256 -0.071907 -0.264203 -0.262769 0.013162 0.074425 0.075116 0.077005 0.069439 0.071250 0.073306 0.098280 0.109364 0.088155 0.094532 0.099327 0.139716 0.104422 0.100766 0.095468 0.096811 0.099894 0.065497 0.060662 0.027872 0.078589 0.091015 0.077442 0.085759 0.079489 0.083661 0.089744
qa: -0.1321 -0.4128 0.6534 -0.4006 -0.3237 -0.3363 -0.1006 0.0678 -0.1360 -0.1196 -0.1271 -0.1166 -0.3058 0.2364 -0.1005 -0.0046 0.0175 -0.0803 -0.0719 -0.2642 -0.2628 0.0132 0.0744 0.0751 0.0770 0.0694 0.0712 0.0733 0.0983 0.1094 0.0882 0.0945 0.0993 0.1397 0.1044 0.1008 0.0955 0.0968 0.0999 0.0655 0.0607 0.0279 0.0786 0.0910 0.0774 0.0858 0.0795 0.0837 0.0897
va: 2.3112 2.0158 5.3990 2.1105 2.1390 2.1167 3.1095 3.9529 3.9242 3.8683 3.8900 3.8792 3.9401 4.2607 3.8380 3.8966 3.8801 3.8844 3.8940 3.9271 3.9638 1.0673 1.0176 1.0175 1.0138 1.0093 1.0173 1.0146 0.9975 1.0476 1.0011 1.0104 1.0156 1.0248 1.0419 0.9978 1.0178 1.0064 0.9955 1.0119 1.0134 1.0216 1.0068 1.0085 1.0127 1.0109 1.0051 1.0019 1.0050
dispcorr: -0.027788781 hartree
energy: -1968.786915249688
dipole: -3.96122 4.58677 0.62555 -16.31270 15.34751 -0.96518 -11.06129 10.11317 -0.94812
magnitude: 1.49058 au
magnitude: 3.78875 debye
