program: Orca
programVersion: 5.0.2
elementType: S S P O O O N C C C C C C C C C C C C C C H H H H H H H H H H H H H H H H H H H H H H H H H H H H
charge: 0
multiplicity: 1
keywords: wb97x-d3
keywords: def2-TZVPP
keywords: def2/J RIJCOSX
keywords: DEFGRID2
keywords: scfconv7
keywords: smallprint printgap noloewdin
keywords: NOSOSCF
formula: C14H28NO3PS2
InChI: InChI=1/C14H28NO3PS2/c1-4-10-17-19(20,18-11-5-2)21-12-14(16)15-9-7-6-8-13(15)3/h13H,4-12H2,1-3H3
49 atoms
S  0.539292 -0.137632 1.365652
S  1.071944 -0.777895 -1.934858
P  1.850417 -0.16833 -0.278733
O  -2.486948 -1.618454 2.463955
O  2.406063 1.326273 -0.192375
O  3.188463 -0.904677 0.180416
N  -2.729597 -0.141985 0.763675
C  -2.30309 0.394338 -0.525322
C  -2.496772 1.911597 -0.541694
C  -3.904967 2.332869 -0.146366
C  -4.260628 1.727794 1.204634
C  -4.072361 0.218467 1.193151
C  -2.99361 -0.311004 -1.689329
C  -2.048027 -1.080098 1.468732
C  -0.652301 -1.46536 0.984522
C  1.58732 2.432725 -0.590078
C  3.489469 -2.255456 -0.185103
C  1.914762 2.89504 -1.994726
C  2.657354 -3.27727 0.563916
C  1.067601 4.10287 -2.372996
C  2.753615 -3.174129 2.078761
H  -1.235884 0.220312 -0.640435
H  -1.783471 2.351722 0.162573
H  -2.238716 2.290275 -1.534042
H  -3.974903 3.421874 -0.111597
H  -4.626591 2.005099 -0.901118
H  -5.294358 1.954972 1.473898
H  -3.626914 2.162171 1.983149
H  -4.81046 -0.241813 0.525675
H  -4.238999 -0.201548 2.181093
H  -2.598172 0.057867 -2.635824
H  -4.073488 -0.161661 -1.699329
H  -2.807476 -1.384822 -1.652665
H  -0.610045 -1.677419 -0.086204
H  -0.361318 -2.359055 1.531639
H  1.781245 3.223999 0.135991
H  0.525206 2.178151 -0.511603
H  3.36597 -2.378351 -1.263937
H  4.547267 -2.373713 0.05205
H  1.736428 2.076555 -2.694551
H  2.976207 3.144136 -2.058158
H  3.001106 -4.26197 0.234664
H  1.615379 -3.209635 0.237369
H  1.243266 4.946055 -1.703123
H  1.293882 4.437027 -3.384464
H  0.001663 3.870477 -2.337403
H  2.365607 -2.224163 2.444946
H  3.787046 -3.263244 2.417237
H  2.182997 -3.969443 2.557452
totalener: -1968.75979160 hartree
nucrepener: 2463.55791595 hartree
electener: -4432.31770755 hartree
oneelecener: -7605.58049646 hartree
twoeener: 3173.26278892 hartree
kineticenergy: 1962.81936366 hartree
xcener: -137.084108520195 hartree
chargesum: 0.0000000
charge: -0.154907 -0.404524 0.638654 -0.397728 -0.313503 -0.308989 -0.090577 0.090162 -0.158295 -0.125497 -0.134791 -0.102740 -0.262472 0.233192 -0.094940 0.071746 0.000057 -0.090792 -0.139389 -0.251491 -0.246075 -0.031931 0.077915 0.078572 0.076192 0.072253 0.073055 0.071278 0.094167 0.110383 0.090802 0.084826 0.093222 0.112710 0.134144 0.104548 0.006407 0.112769 0.100198 0.067880 0.068357 0.078509 0.064762 0.077159 0.091464 0.071654 0.090280 0.078355 0.092970
qa: -0.1549 -0.4045 0.6387 -0.3977 -0.3135 -0.3090 -0.0906 0.0902 -0.1583 -0.1255 -0.1348 -0.1027 -0.2625 0.2332 -0.0949 0.0717 0.0001 -0.0908 -0.1394 -0.2515 -0.2461 -0.0319 0.0779 0.0786 0.0762 0.0723 0.0731 0.0713 0.0942 0.1104 0.0908 0.0848 0.0932 0.1127 0.1341 0.1045 0.0064 0.1128 0.1002 0.0679 0.0684 0.0785 0.0648 0.0772 0.0915 0.0717 0.0903 0.0784 0.0930
va: 2.2963 2.0339 5.4177 2.1144 2.1628 2.1470 3.1059 3.9671 3.9080 3.9002 3.9121 3.8678 3.9546 4.2922 3.7774 3.9326 3.8783 3.8822 3.8782 3.9448 3.9150 1.0787 1.0136 1.0138 1.0142 1.0100 1.0171 1.0155 0.9996 1.0447 1.0098 1.0070 1.0097 1.0473 1.0206 0.9997 1.0126 1.0142 0.9947 1.0294 1.0141 1.0170 1.0146 1.0040 1.0064 1.0041 1.0159 1.0080 1.0040
dispcorr: -0.028575417 hartree
energy: -1968.788367013534
dipole: -12.59700 12.70729 0.11029 9.52531 -8.78406 0.74125 -7.17250 6.26307 -0.90944
magnitude: 1.17843 au
magnitude: 2.99532 debye
