program: Gaussian 09
title: 000056135
version: EM64L-G09RevD.01
frameworkgroup: C1[X(C10H22N2)]
method: RPBEPBE
basis: SDD
operation: Freq
keyword: #pfreq=noraman
keyword: PBEPBE/SDD
title: #p freq=noraman PBEPBE/SDD
converged: YES YES NO NO
title: Mulliken charges:
elementType: N N C C C C C C C C C C H H H H H H H H H H H H H H H H H H H H H H
charge: -0.326739 -0.294211 0.011488 -0.417018 -0.455224 -0.395989 -0.395628 -0.384860 -0.353625 -0.411290 -0.351659 -0.626136 0.168222 0.205621 0.198897 0.180626 0.210179 0.196828 0.189452 0.191439 0.197484 0.195339 0.190792 0.237636 0.201436 0.168869 0.203744 0.203642 0.203450 0.172281 0.251010 0.188319 0.221072 0.224552
chargesum: 0.00000
title: Mulliken charges with hydrogens summed into heavy atoms:
elementType: N N C C C C C C C C C C
charge: -0.089103 -0.043201 0.179710 -0.012500 -0.064418 -0.009709 -0.006704 0.001271 0.016680 -0.003904 0.024073 0.007807
polarizability: 1.55597868e+02 4.10326370e-01 1.10191276e+02 -3.66508829e-01 1.45587294e+00 1.00105053e+02
1716.lowfreq: -4.0161 -0.0003 0.0003 0.0008 9.2245 23.7262 38.6941 46.0175 57.7990
frequency: 36.9511 45.9461 57.4521 89.0079 111.1524 126.1132 152.7655 194.3841 214.7165 222.7666 236.6466 309.6245 326.2669 403.8306 406.9091 445.9378 471.7261 485.5218 564.8805 661.6916 680.8838 771.4896 780.7336 787.9461 844.4439 875.1150 882.7322 893.6958 920.2520 951.6355 966.3215 1030.5160 1039.8186 1051.1126 1057.1154 1063.9578 1073.8881 1098.7173 1114.3448 1126.4319 1138.7443 1149.0192 1155.3906 1167.1000 1190.6551 1218.2528 1240.8990 1251.0255 1255.4417 1267.3200 1273.5250 1276.5900 1304.0652 1309.5348 1333.5315 1334.0703 1340.1538 1344.4135 1361.1086 1367.5676 1383.4310 1435.0356 1448.4179 1457.6338 1461.3436 1463.1521 1465.2181 1466.5088 1470.8299 1471.8268 1478.2944 1487.7156 1495.1748 1501.5475 2808.3232 2833.5124 2837.1549 2865.5338 2957.8958 2964.1047 2967.2595 2968.6987 2973.7397 2977.6910 2987.3934 3001.5692 3010.0968 3017.3747 3026.5364 3028.3762 3035.9707 3039.6549 3045.0813 3072.8894 3404.7921 3445.3309
redmass: 2.9535 1.8804 3.3795 3.1362 1.8494 2.4991 2.6723 2.6761 2.8191 2.1768 1.2123 2.9639 1.7521 2.6329 3.4165 2.8835 1.9249 2.5954 2.1107 1.3674 1.4114 1.0901 1.8627 1.7210 2.0471 1.5459 1.3130 1.5460 1.8969 2.1394 2.3717 3.4033 2.1054 1.4796 1.2620 1.7501 1.7689 1.3754 2.3111 1.7505 1.8909 3.4659 2.0019 2.8062 1.5659 1.6000 1.3405 1.2672 1.2590 1.1876 1.1074 1.2697 1.2238 1.3535 1.3816 1.4340 1.4708 1.5039 1.4109 1.4705 1.5727 1.1531 1.1997 1.1527 1.0923 1.0903 1.0754 1.1620 1.0838 1.0816 1.0978 1.0661 1.0695 1.0816 1.0803 1.0705 1.0725 1.0571 1.0598 1.0618 1.0601 1.0663 1.0601 1.0616 1.0853 1.0857 1.0743 1.0988 1.0952 1.1001 1.1028 1.1026 1.1031 1.0993 1.0737 1.0744
irintensity: 0.7277 1.4471 0.5641 1.4668 2.4860 1.3431 0.8634 2.7132 0.5488 0.4374 1.4362 1.3902 1.2943 12.0107 8.2433 4.2772 2.3925 2.3230 8.2353 84.8578 111.7369 4.0439 0.7239 0.1569 7.3516 2.0398 2.5199 9.3310 2.4610 3.0347 4.6249 1.6429 2.6394 0.7632 1.1851 16.4517 2.6461 3.4397 1.1930 17.6577 15.0622 50.4812 2.7364 14.9839 3.7386 2.8257 1.1842 3.3263 1.8494 10.0754 0.3825 5.1754 2.5020 1.0804 0.9167 1.2565 1.1471 9.5040 6.9965 33.0007 1.5953 1.6722 21.1944 3.6983 2.4686 7.1818 10.4931 12.3144 24.5817 3.3790 2.3957 18.5151 0.8646 5.7111 74.4414 91.6212 117.7004 174.9695 43.0372 34.2970 44.8195 39.6576 26.8310 21.0270 31.0356 15.6028 52.5230 60.4772 67.0195 37.8663 3.0464 107.0009 127.8413 41.8623 3.9997 1.4166
temp: 298.150 k
press: 1.00000 atm
elementType: 7 7 6 6 6 6 6 6 6 6 6 6 1 1 1 1 1 1 1 1 1 1 1 1 1 1 1 1 1 1 1 1 1 1
symmnumber: 1
zpe: 817103.0 jmol-1
zpe.correction: 0.311218 hartree
zpe.thermalcorrener: 0.325322 hartree
zpe.thermalcorrenthalpy: 0.326267 hartree
zpe.thermalcorrgfe: 0.269406 hartree
zpe.sumelectzpe: -502.732671 hartree
zpe.sumelectthermal: -502.718567 hartree
zpe.sumelectthermalent: -502.717623 hartree
zpe.sumelectthermalfe: -502.774483 hartree
dipole: -0.0681 0.6741 0.3787
dipole: 0.7762
quadrupole: -74.2203 -77.5217 -76.5764
quadrupole: 4.7276 -2.8811 -0.3271
quadrupole: 1.8858 -1.4156 -0.4703 4.7276 -2.8811 -0.3271
hfenergy: -503.0438894 hartree
pointgroup: C01 [X(C10H22N2)]
dipole: 0.0257046 0.2669175 -0.1461323 debye
polarizability: 155.6019241|-0.1743648|110.2181993|-0.2668213|-1.3502605|100.074074 unknown
InChI: InChI=1S/C10H22N2/c1-11-8-5-9-12-10-6-3-2-4-7-10/h10-12H,2-9H2,1H3
charge 0 multiplicity 1
34 atoms
N  0.162248 -0.61016 0.257563
N  -4.800183 -0.301215 0.256374
C  1.493536 -0.184727 -0.243651
C  1.931088 1.161578 0.386372
C  2.534294 -1.282515 0.079528
C  3.347592 1.572492 -0.082129
C  3.954652 -0.885695 -0.386528
C  4.387097 0.468514 0.225263
C  -0.994918 0.169312 -0.236852
C  -2.318312 -0.449292 0.252906
C  -3.556784 0.323436 -0.239465
C  -6.0401 0.360109 -0.18868
H  1.480009 -0.045116 -1.359166
H  1.910311 1.0431 1.488329
H  1.207178 1.959672 0.131878
H  2.230958 -2.237686 -0.398128
H  2.529867 -1.451258 1.175519
H  3.642388 2.523179 0.402967
H  3.33247 1.763625 -1.175661
H  3.970474 -0.806451 -1.493406
H  4.676296 -1.679482 -0.112366
H  5.383794 0.761145 -0.158843
H  4.484532 0.357045 1.325009
H  0.016953 -1.615743 0.07922
H  -0.915106 1.205361 0.145241
H  -1.012653 0.242307 -1.35622
H  -2.402067 -1.498948 -0.094073
H  -2.302653 -0.47736 1.361326
H  -3.587954 0.307661 -1.347979
H  -3.463296 1.401044 0.0596
H  -4.772815 -0.425625 1.277406
H  -6.105881 1.446148 0.072162
H  -6.914815 -0.152093 0.250243
H  -6.125903 0.280137 -1.288758
