program: Orca
programVersion: 5.0.2
elementType: S S P O O O N C C C C C C C C C C C C C C H H H H H H H H H H H H H H H H H H H H H H H H H H H H
charge: 0
multiplicity: 1
keywords: wb97x-d3
keywords: def2-TZVPP
keywords: def2/J RIJCOSX
keywords: DEFGRID2
keywords: scfconv7
keywords: smallprint printgap noloewdin
keywords: NOSOSCF
formula: C14H28NO3PS2
InChI: InChI=1/C14H28NO3PS2/c1-4-10-17-19(20,18-11-5-2)21-12-14(16)15-9-7-6-8-13(15)3/h13H,4-12H2,1-3H3
49 atoms
S  -0.441466 1.473007 -1.458718
S  2.150571 -0.065508 -2.777723
P  1.208121 0.244157 -1.140222
O  -0.65793 0.604228 2.184503
O  2.024483 0.931074 0.057263
O  0.576969 -1.019193 -0.396222
N  -2.268874 -0.197645 0.814604
C  -3.1813 -0.074058 -0.317525
C  -4.624135 -0.057359 0.200811
C  -4.935561 -1.247388 1.10132
C  -3.911893 -1.343013 2.226131
C  -2.495879 -1.351345 1.668985
C  -2.945723 -1.15566 -1.367973
C  -1.304503 0.687781 1.158829
C  -1.017131 1.864278 0.231848
C  2.88644 2.044548 -0.187208
C  1.240255 -2.292573 -0.369125
C  3.654624 2.34261 1.081716
C  2.376558 -2.346968 0.630321
C  4.547054 1.195831 1.534934
C  1.953642 -2.051469 2.061284
H  -3.00123 0.882471 -0.804789
H  -4.779669 0.867585 0.764759
H  -5.309678 -0.026077 -0.649474
H  -5.944623 -1.152539 1.507256
H  -4.929509 -2.173316 0.517968
H  -4.073967 -2.244491 2.821209
H  -4.021119 -0.491518 2.904105
H  -2.327635 -2.265083 1.089299
H  -1.759158 -1.338443 2.46684
H  -3.577149 -0.970097 -2.237263
H  -3.179393 -2.156536 -1.005455
H  -1.909605 -1.14825 -1.69928
H  -0.272641 2.479764 0.730393
H  -1.902376 2.485097 0.075425
H  2.287826 2.908968 -0.493164
H  3.568111 1.804628 -1.009016
H  0.458068 -3.00438 -0.10179
H  1.594223 -2.535295 -1.374571
H  2.955709 2.614282 1.876219
H  4.2610 3.230926 0.885828
H  3.174289 -1.668948 0.316279
H  2.801054 -3.353267 0.565133
H  5.248809 0.905858 0.750994
H  5.130512 1.481147 2.409704
H  3.963076 0.316609 1.8042
H  1.20229 -2.765428 2.404332
H  1.530143 -1.054128 2.164235
H  2.804951 -2.125627 2.73792
totalener: -1968.75910000 hartree
nucrepener: 2506.97438497 hartree
electener: -4475.73348497 hartree
oneelecener: -7693.24468598 hartree
twoeener: 3217.51120101 hartree
kineticenergy: 1962.83297797 hartree
xcener: -137.081655245848 hartree
chargesum: -0.0000000
charge: -0.152571 -0.378885 0.588633 -0.406018 -0.293233 -0.297928 -0.051692 -0.031860 -0.130425 -0.127023 -0.129640 -0.110731 -0.256681 0.222016 -0.135814 -0.029379 -0.028802 -0.083066 -0.086190 -0.243241 -0.265240 0.079199 0.072785 0.075506 0.077842 0.071553 0.071530 0.073657 0.091069 0.108368 0.088192 0.078327 0.095725 0.140381 0.127127 0.099144 0.107557 0.086581 0.116755 0.068616 0.058349 0.056915 0.070249 0.076022 0.089514 0.077870 0.071285 0.107637 0.090015
qa: -0.1526 -0.3789 0.5886 -0.4060 -0.2932 -0.2979 -0.0517 -0.0319 -0.1304 -0.1270 -0.1296 -0.1107 -0.2567 0.2220 -0.1358 -0.0294 -0.0288 -0.0831 -0.0862 -0.2432 -0.2652 0.0792 0.0728 0.0755 0.0778 0.0716 0.0715 0.0737 0.0911 0.1084 0.0882 0.0783 0.0957 0.1404 0.1271 0.0991 0.1076 0.0866 0.1168 0.0686 0.0583 0.0569 0.0702 0.0760 0.0895 0.0779 0.0713 0.1076 0.0900
va: 2.2703 2.0982 5.4538 2.0922 2.0972 2.0893 3.0682 4.0173 3.9047 3.8750 3.9162 3.8833 3.9272 4.1538 3.8558 3.8860 3.8927 3.9147 3.8428 3.9341 3.9123 1.0079 1.0178 1.0148 1.0138 1.0087 1.0170 1.0149 0.9962 1.0438 1.0117 1.0040 1.0309 1.0201 1.0018 0.9988 1.0133 0.9927 1.0180 1.0139 1.0108 1.0299 1.0180 1.0043 1.0092 1.0056 1.0088 1.0142 1.0043
dispcorr: -0.030384499 hartree
energy: -1968.789484499273
dipole: -6.19613 5.21849 -0.97763 -10.25288 10.15805 -0.09483 19.00751 -18.49367 0.51384
magnitude: 1.10851 au
magnitude: 2.81761 debye
