program: Orca
programVersion: 5.0.2
elementType: S S P O O O N C C C C C C C C C C C C C C H H H H H H H H H H H H H H H H H H H H H H H H H H H H
charge: 0
multiplicity: 1
keywords: wb97x-d3
keywords: def2-TZVPP
keywords: def2/J RIJCOSX
keywords: DEFGRID2
keywords: scfconv7
keywords: smallprint printgap noloewdin
keywords: NOSOSCF
formula: C14H28NO3PS2
InChI: InChI=1/C14H28NO3PS2/c1-4-10-17-19(20,18-11-5-2)21-12-14(16)15-9-7-6-8-13(15)3/h13H,4-12H2,1-3H3
49 atoms
S  0.163308 0.982306 0.584059
S  2.325633 1.269557 -2.024808
P  1.934692 0.36806 -0.374785
O  -1.561211 -0.705514 -2.019767
O  2.93103 0.561198 0.860867
O  1.905846 -1.222894 -0.416008
N  -2.873972 -0.216227 -0.244706
C  -3.186332 0.554137 0.955663
C  -3.085738 -0.350827 2.187251
C  -3.918815 -1.61929 2.050999
C  -3.55925 -2.347803 0.762398
C  -3.676423 -1.41528 -0.435102
C  -4.534476 1.259808 0.834242
C  -1.831677 0.0191 -1.079577
C  -0.970645 1.241455 -0.819493
C  3.819083 1.682501 0.954661
C  1.643755 -1.958189 -1.624175
C  3.134008 2.936366 1.458005
C  1.334958 -3.388616 -1.242721
C  2.534845 2.794843 2.848882
C  0.057454 -3.539984 -0.430747
H  -2.435373 1.332629 1.077927
H  -2.034446 -0.620844 2.322303
H  -3.38236 0.215564 3.073201
H  -3.754453 -2.264718 2.915901
H  -4.985924 -1.375354 2.051972
H  -4.208549 -3.212842 0.611026
H  -2.534765 -2.725551 0.821874
H  -4.722724 -1.128435 -0.583154
H  -3.351177 -1.90365 -1.348954
H  -4.708705 1.883826 1.711381
H  -5.372547 0.567463 0.75754
H  -4.555412 1.904011 -0.045137
H  -1.544526 2.140639 -0.596246
H  -0.378143 1.443369 -1.712509
H  4.282215 1.863389 -0.018177
H  4.598549 1.362905 1.647858
H  0.805417 -1.515507 -2.16477
H  2.527055 -1.903735 -2.263837
H  2.371414 3.248282 0.739871
H  3.888309 3.728335 1.458311
H  2.184762 -3.815329 -0.703983
H  1.248706 -3.953116 -2.174679
H  2.077337 3.729514 3.172003
H  1.763231 2.026724 2.879793
H  3.297412 2.529477 3.583419
H  -0.801128 -3.163019 -0.98714
H  0.115345 -2.98924 0.508412
H  -0.129544 -4.586629 -0.189746
totalener: -1968.76003348 hartree
nucrepener: 2457.47964717 hartree
electener: -4426.23968065 hartree
oneelecener: -7594.28352051 hartree
twoeener: 3168.04383986 hartree
kineticenergy: 1962.83102109 hartree
xcener: -137.084183140980 hartree
chargesum: -0.0000000
charge: -0.185670 -0.390670 0.624142 -0.427141 -0.330705 -0.308572 -0.065797 -0.054206 -0.116615 -0.121167 -0.115776 -0.141124 -0.262383 0.258734 -0.116292 0.008137 -0.032297 -0.124683 -0.076239 -0.229712 -0.259214 0.082310 0.078467 0.074459 0.079089 0.070716 0.074919 0.067714 0.104198 0.115379 0.088178 0.080616 0.095027 0.124355 0.151150 0.109036 0.093895 0.120325 0.111447 0.070263 0.069941 0.062422 0.055870 0.083835 0.081460 0.071957 0.077320 0.080802 0.092101
qa: -0.1857 -0.3907 0.6241 -0.4271 -0.3307 -0.3086 -0.0658 -0.0542 -0.1166 -0.1212 -0.1158 -0.1411 -0.2624 0.2587 -0.1163 0.0081 -0.0323 -0.1247 -0.0762 -0.2297 -0.2592 0.0823 0.0785 0.0745 0.0791 0.0707 0.0749 0.0677 0.1042 0.1154 0.0882 0.0806 0.0950 0.1244 0.1511 0.1090 0.0939 0.1203 0.1114 0.0703 0.0699 0.0624 0.0559 0.0838 0.0815 0.0720 0.0773 0.0808 0.0921
va: 2.2645 2.0529 5.4552 2.0641 2.1300 2.1388 3.1034 4.0334 3.8804 3.8736 3.8980 3.8839 3.9519 4.1436 3.8037 3.8754 3.8491 3.8676 3.9365 3.9227 3.9077 1.0027 1.0309 1.0154 1.0134 1.0097 1.0181 1.0209 0.9986 1.0386 1.0072 1.0063 1.0111 1.0043 1.0507 1.0191 0.9946 1.0088 1.0103 1.0260 1.0179 1.0143 1.0123 1.0061 1.0099 1.0055 1.0137 1.0112 1.0059
dispcorr: -0.028050161 hartree
energy: -1968.788083644497
dipole: -19.20896 18.22190 -0.98706 -7.28436 7.47106 0.18670 15.34484 -14.03822 1.30662
magnitude: 1.64815 au
magnitude: 4.18926 debye
