program: Orca
programVersion: 5.0.2
elementType: S S P O O O N C C C C C C C C C C C C C C H H H H H H H H H H H H H H H H H H H H H H H H H H H H
charge: 0
multiplicity: 1
keywords: wb97x-d3
keywords: def2-TZVPP
keywords: def2/J RIJCOSX
keywords: DEFGRID2
keywords: scfconv7
keywords: smallprint printgap noloewdin
keywords: NOSOSCF
formula: C14H28NO3PS2
InChI: InChI=1/C14H28NO3PS2/c1-4-10-17-19(20,18-11-5-2)21-12-14(16)15-9-7-6-8-13(15)3/h13H,4-12H2,1-3H3
49 atoms
S  0.26475 0.684002 0.518236
S  2.329808 1.237442 -2.140269
P  2.10275 0.330272 -0.463838
O  -1.608608 -0.787719 -2.087676
O  3.110255 0.669655 0.727667
O  2.294098 -1.251734 -0.46343
N  -2.870503 -0.268686 -0.284234
C  -3.12053 0.480887 0.943081
C  -3.120726 -0.478441 2.137468
C  -4.069015 -1.655524 1.946156
C  -3.762958 -2.366371 0.634887
C  -3.774316 -1.383257 -0.527002
C  -4.394404 1.316361 0.843486
C  -1.823292 -0.074939 -1.12474
C  -0.883656 1.08363 -0.840524
C  3.834892 1.90637 0.771911
C  1.681478 -2.052921 -1.488168
C  2.996196 3.072318 1.255813
C  1.336809 -3.403647 -0.902942
C  2.456073 2.902207 2.667323
C  0.253041 -3.337091 0.162923
H  -2.297667 1.175932 1.102966
H  -2.101668 -0.853796 2.270101
H  -3.371846 0.078931 3.042994
H  -3.978476 -2.344975 2.787569
H  -5.108203 -1.311691 1.945876
H  -4.490259 -3.158207 0.442748
H  -2.781236 -2.844883 0.692495
H  -4.788523 -0.99808 -0.676421
H  -3.47944 -1.866136 -1.453993
H  -4.518581 1.916087 1.745484
H  -5.292585 0.710185 0.730811
H  -4.345943 1.996597 -0.007101
H  -1.395014 2.006915 -0.570311
H  -0.299871 1.279894 -1.740668
H  4.25065 2.119679 -0.21558
H  4.663356 1.71777 1.455809
H  0.780621 -1.572537 -1.879476
H  2.391604 -2.144629 -2.312268
H  2.181191 3.253933 0.550862
H  3.635702 3.958189 1.208215
H  2.240257 -3.872314 -0.504904
H  1.002571 -4.034256 -1.730813
H  3.264038 2.751984 3.385249
H  1.899497 3.785608 2.978923
H  1.782584 2.049523 2.740435
H  0.551751 -2.709208 1.001741
H  0.027281 -4.329411 0.55345
H  -0.66682 -2.923969 -0.252647
totalener: -1968.75970594 hartree
nucrepener: 2453.82202965 hartree
electener: -4422.58173559 hartree
oneelecener: -7586.79095589 hartree
twoeener: 3164.20922030 hartree
kineticenergy: 1962.82579576 hartree
xcener: -137.082590812878 hartree
chargesum: -0.0000000
charge: -0.185763 -0.384012 0.623796 -0.419889 -0.327023 -0.308231 -0.067005 -0.054774 -0.116038 -0.114508 -0.134031 -0.130078 -0.262000 0.243545 -0.116765 0.005804 -0.036125 -0.122076 -0.067242 -0.230797 -0.262772 0.083831 0.077625 0.075042 0.079076 0.069447 0.075083 0.074963 0.102465 0.115645 0.088215 0.081132 0.094227 0.120616 0.156364 0.110596 0.095467 0.107945 0.113738 0.068056 0.070491 0.065277 0.058709 0.071880 0.083128 0.082367 0.086859 0.093402 0.064335
qa: -0.1858 -0.3840 0.6238 -0.4199 -0.3270 -0.3082 -0.0670 -0.0548 -0.1160 -0.1145 -0.1340 -0.1301 -0.2620 0.2435 -0.1168 0.0058 -0.0361 -0.1221 -0.0672 -0.2308 -0.2628 0.0838 0.0776 0.0750 0.0791 0.0694 0.0751 0.0750 0.1025 0.1156 0.0882 0.0811 0.0942 0.1206 0.1564 0.1106 0.0955 0.1079 0.1137 0.0681 0.0705 0.0653 0.0587 0.0719 0.0831 0.0824 0.0869 0.0934 0.0643
va: 2.2572 2.0646 5.4505 2.0688 2.1330 2.1383 3.1045 4.0299 3.8849 3.8601 3.9047 3.8677 3.9529 4.1728 3.7944 3.8731 3.8691 3.8674 3.9049 3.9226 3.9166 1.0031 1.0264 1.0155 1.0138 1.0100 1.0195 1.0193 0.9980 1.0448 1.0073 1.0060 1.0111 1.0063 1.0518 1.0191 0.9946 1.0209 1.0115 1.0250 1.0175 1.0158 1.0129 1.0058 1.0061 1.0115 1.0134 1.0074 1.0128
dispcorr: -0.028246150 hartree
energy: -1968.787952087602
dipole: -20.87863 19.79719 -1.08144 -5.58101 5.84583 0.26483 16.96158 -15.54526 1.41632
magnitude: 1.80156 au
magnitude: 4.57920 debye
