program: Orca
programVersion: 5.0.2
elementType: S S P O O O N C C C C C C C C C C C C C C H H H H H H H H H H H H H H H H H H H H H H H H H H H H
charge: 0
multiplicity: 1
keywords: wb97x-d3
keywords: def2-TZVPP
keywords: def2/J RIJCOSX
keywords: DEFGRID2
keywords: scfconv7
keywords: smallprint printgap noloewdin
keywords: NOSOSCF
formula: C14H28NO3PS2
InChI: InChI=1/C14H28NO3PS2/c1-4-10-17-19(20,18-11-5-2)21-12-14(16)15-9-7-6-8-13(15)3/h13H,4-12H2,1-3H3
49 atoms
S  -0.305883 -1.610501 0.065744
S  2.060953 -0.423044 -2.064637
P  1.44814 -0.502624 -0.246866
O  -1.314456 1.405793 -1.53999
O  1.197654 0.862927 0.52767
O  2.379484 -1.261366 0.814094
N  -2.84667 0.646657 -0.062726
C  -3.446637 -0.404736 0.752693
C  -4.969309 -0.369782 0.588843
C  -5.552434 1.012442 0.859932
C  -4.847026 2.058896 0.006615
C  -3.338204 1.991637 0.194938
C  -3.003991 -0.309446 2.211172
C  -1.842214 0.47687 -0.958767
C  -1.357859 -0.933873 -1.257127
C  1.384051 2.17261 -0.034672
C  3.065255 -2.46777 0.448436
C  2.604496 2.844528 0.556051
C  4.536113 -2.203685 0.204895
C  3.917394 2.152748 0.220281
C  5.275304 -1.670277 1.423149
H  -3.103754 -1.368607 0.380401
H  -5.215567 -0.667685 -0.434976
H  -5.418029 -1.115569 1.249257
H  -6.624919 1.01035 0.655758
H  -5.445854 1.266945 1.918731
H  -5.196661 3.062632 0.25801
H  -5.082065 1.897467 -1.049472
H  -3.07424 2.293148 1.214734
H  -2.830301 2.675879 -0.478272
H  -3.359177 0.596356 2.701903
H  -1.917353 -0.330602 2.280844
H  -3.394465 -1.158234 2.773534
H  -0.774027 -0.896095 -2.17687
H  -2.163802 -1.65382 -1.400744
H  0.476822 2.728727 0.197534
H  1.460575 2.104618 -1.121501
H  2.923196 -3.159269 1.281309
H  2.610055 -2.916443 -0.438921
H  2.489425 2.9332 1.63938
H  2.615281 3.866591 0.166131
H  4.636669 -1.518227 -0.639672
H  4.983649 -3.149466 -0.113767
H  3.978683 1.165472 0.677144
H  4.036532 2.024662 -0.855925
H  4.765119 2.731673 0.586335
H  6.32881 -1.507573 1.19755
H  5.221521 -2.370081 2.258905
H  4.86224 -0.720928 1.761912
totalener: -1968.75921206 hartree
nucrepener: 2439.85441311 hartree
electener: -4408.61362517 hartree
oneelecener: -7559.33924208 hartree
twoeener: 3150.72561692 hartree
kineticenergy: 1962.83089518 hartree
xcener: -137.083691198915 hartree
chargesum: -0.0000000
charge: -0.179376 -0.384010 0.634330 -0.413947 -0.323779 -0.336363 -0.066960 -0.032595 -0.136253 -0.126070 -0.133066 -0.107779 -0.252597 0.237094 -0.129694 0.017026 0.005267 -0.072345 -0.118833 -0.242639 -0.237425 0.077705 0.074873 0.075724 0.078025 0.072057 0.072433 0.072822 0.098375 0.107503 0.079797 0.100089 0.083699 0.153206 0.126729 0.091409 0.111961 0.095579 0.099602 0.057252 0.059968 0.072406 0.065003 0.052434 0.084757 0.087962 0.085830 0.073279 0.089532
qa: -0.1794 -0.3840 0.6343 -0.4139 -0.3238 -0.3364 -0.0670 -0.0326 -0.1363 -0.1261 -0.1331 -0.1078 -0.2526 0.2371 -0.1297 0.0170 0.0053 -0.0723 -0.1188 -0.2426 -0.2374 0.0777 0.0749 0.0757 0.0780 0.0721 0.0724 0.0728 0.0984 0.1075 0.0798 0.1001 0.0837 0.1532 0.1267 0.0914 0.1120 0.0956 0.0996 0.0573 0.0600 0.0724 0.0650 0.0524 0.0848 0.0880 0.0858 0.0733 0.0895
va: 2.2710 2.0535 5.4567 2.0834 2.1274 2.1073 3.1073 4.0282 3.9117 3.8718 3.9131 3.8676 3.9159 4.1252 3.7991 3.8601 3.8801 3.9013 3.9106 3.9321 3.9167 1.0039 1.0179 1.0146 1.0144 1.0088 1.0173 1.0144 0.9966 1.0480 1.0050 1.0303 1.0087 1.0431 1.0012 1.0039 1.0159 0.9968 1.0166 1.0129 1.0129 1.0270 1.0164 1.0148 1.0130 1.0091 1.0067 1.0042 1.0029
dispcorr: -0.027539392 hartree
energy: -1968.786751451252
dipole: -3.70584 2.62982 -1.07603 7.54137 -7.89739 -0.35602 13.76251 -12.68354 1.07896
magnitude: 1.56485 au
magnitude: 3.97752 debye
