program: Gaussian 09
title: 000056133
version: EM64L-G09RevD.01
frameworkgroup: C1[X(C9H20N2)]
method: RPBEPBE
basis: SDD
operation: Freq
keyword: #pfreq=noraman
keyword: PBEPBE/SDD
title: #p freq=noraman PBEPBE/SDD
converged: YES YES NO NO
title: Mulliken charges:
elementType: N N C C C C C C C C C H H H H H H H H H H H H H H H H H H H H
charge: -0.314533 -0.545743 -0.022493 -0.486181 -0.443258 -0.411602 -0.442652 -0.366105 -0.382271 -0.350967 -0.411258 0.186477 0.221566 0.201189 0.220483 0.207467 0.211292 0.209199 0.208105 0.208893 0.237111 0.171426 0.207372 0.174547 0.212765 0.181931 0.183700 0.208154 0.204790 0.260640 0.259955
chargesum: 0.00000
title: Mulliken charges with hydrogens summed into heavy atoms:
elementType: N N C C C C C C C C C
charge: -0.077422 -0.025148 0.163985 -0.063425 -0.015307 0.008889 -0.025654 0.012693 0.005041 0.014664 0.001685
polarizability: 1.40794159e+02 -1.53367003e+00 1.00886037e+02 -1.02988130e+00 1.36333157e-02 9.11196866e+01
1716.lowfreq: -0.0006 -0.0005 0.0003 6.6885 8.1092 19.8855 34.2272 43.8435 49.0866
frequency: 34.1857 43.0930 48.9499 65.5616 91.3731 114.2110 145.8663 155.0948 202.5263 231.5700 259.9769 317.7514 421.3955 439.1956 481.0740 573.4115 607.7438 617.0835 688.6036 734.6591 766.8117 781.6191 805.0461 866.7790 892.2916 894.2688 939.2062 960.2163 980.1022 995.5276 1008.1891 1024.5550 1056.5609 1066.9690 1074.4322 1093.3602 1113.5013 1148.1454 1166.7180 1171.1865 1175.4736 1200.8263 1230.2433 1237.8871 1245.9098 1265.4815 1277.5709 1278.8365 1284.0808 1289.1956 1304.1635 1310.0491 1326.3959 1334.0486 1350.7327 1354.6833 1377.5844 1455.9674 1457.7827 1465.1846 1466.9257 1470.6932 1473.6926 1478.4413 1490.5313 1495.6301 1643.0976 2823.3836 2837.7198 2951.1916 2956.2604 2980.7532 2986.1087 2990.8065 2992.8950 2997.4716 3004.5532 3010.6202 3031.1185 3038.6150 3048.1009 3054.2194 3060.3507 3077.7521 3411.3306 3449.3898 3575.1480
redmass: 3.1724 1.9222 1.6931 3.3944 3.1232 1.7357 2.3143 2.8148 2.4723 4.3463 1.0764 3.0023 2.3063 3.3180 2.1682 2.3427 2.1908 1.8400 1.5430 1.0721 1.1877 1.1453 1.7425 2.9650 1.3245 2.0558 1.6778 1.8944 1.3046 3.3949 1.2591 2.8111 3.0895 2.6092 2.3542 3.1359 2.2223 2.2910 1.8238 1.4818 1.6244 1.5245 1.3647 1.2590 1.2064 1.3147 1.2044 1.1757 1.1264 1.2663 1.3400 1.3556 1.4066 1.1745 1.5235 1.3763 1.4940 1.2408 1.0807 1.0819 1.0793 1.0925 1.0838 1.0906 1.0983 1.0897 1.0886 1.0810 1.0719 1.0619 1.0617 1.0607 1.0582 1.0595 1.0637 1.0954 1.0855 1.0651 1.1010 1.1017 1.1048 1.1007 1.1047 1.1049 1.0738 1.0445 1.0973
irintensity: 0.1380 0.2228 2.4951 0.3969 1.6278 2.3282 0.0389 1.9019 2.5546 1.1802 59.1189 3.9990 23.2358 5.7704 2.0209 14.0701 78.6188 267.7079 68.0645 8.1369 5.4580 0.0053 1.8892 1.8859 0.5636 4.2507 6.0288 0.7356 1.7356 15.4408 0.2370 1.0014 7.4267 7.1446 1.7482 10.8766 2.6344 37.3421 1.4681 1.2526 18.6822 0.6487 9.4923 2.3762 3.1063 1.7132 2.4188 2.4139 0.4481 4.2677 0.3666 0.8182 0.1568 0.2149 53.4939 4.5158 1.0079 12.7254 0.0383 3.1000 0.4490 5.5404 10.1701 10.5314 6.7992 4.8399 31.8751 56.2644 141.8559 2.8468 45.8833 65.0343 14.5438 64.7187 34.5793 13.5216 22.7160 55.9790 7.3687 17.1397 129.8385 12.8831 22.8564 111.3055 2.6010 1.3989 0.0738
temp: 298.150 k
press: 1.00000 atm
elementType: 7 7 6 6 6 6 6 6 6 6 6 1 1 1 1 1 1 1 1 1 1 1 1 1 1 1 1 1 1 1 1
symmnumber: 1
zpe: 742269.1 jmol-1
zpe.correction: 0.282715 hartree
zpe.thermalcorrener: 0.296200 hartree
zpe.thermalcorrenthalpy: 0.297144 hartree
zpe.thermalcorrgfe: 0.240870 hartree
zpe.sumelectzpe: -463.511167 hartree
zpe.sumelectthermal: -463.497682 hartree
zpe.sumelectthermalent: -463.496738 hartree
zpe.sumelectthermalfe: -463.553012 hartree
dipole: 0.9150 0.6476 1.5270
dipole: 1.8943
quadrupole: -81.2546 -67.6669 -69.7485
quadrupole: -5.7542 -3.9189 -1.7024
quadrupole: -8.3646 5.2231 3.1415 -5.7542 -3.9189 -1.7024
hfenergy: -463.7938821 hartree
pointgroup: C01 [X(C9H20N2)]
dipole: -0.3605096 -0.2489802 0.6028972 debye
polarizability: 140.8010917|-1.339063|100.8712178|1.1842448|-0.1328841|91.1275735 unknown
InChI: InChI=1S/C9H20N2/c10-7-3-4-8-11-9-5-1-2-6-9/h9,11H,1-8,10H2
charge 0 multiplicity 1
31 atoms
N  -0.576894 0.647088 -0.1097
N  5.726766 -0.395516 0.078444
C  -1.886971 0.156594 0.372856
C  -3.031648 1.141987 0.01416
C  -2.3435 -1.164959 -0.296406
C  -4.33342 0.279397 -0.063302
C  -3.862518 -1.212048 0.004552
C  0.596969 -0.141573 0.329094
C  1.90826 0.481988 -0.186718
C  3.164193 -0.312555 0.237316
C  4.485066 0.319126 -0.281603
H  -1.883614 -0.006487 1.483504
H  -2.796797 1.58457 -0.972917
H  -3.117157 1.969657 0.742451
H  -1.808417 -2.056456 0.077621
H  -2.153807 -1.080474 -1.384225
H  -4.874211 0.479955 -1.00574
H  -5.030194 0.51406 0.761495
H  -4.031469 -1.61851 1.020191
H  -4.411099 -1.861382 -0.700669
H  -0.450174 1.643411 0.124097
H  0.652165 -0.246409 1.444669
H  0.497617 -1.166479 -0.078355
H  1.992035 1.525128 0.188976
H  1.854647 0.549611 -1.29112
H  3.209369 -0.382392 1.344802
H  3.090729 -1.354069 -0.14101
H  4.442397 0.396141 -1.385713
H  4.565881 1.357042 0.09734
H  5.802341 -1.3306 -0.335146
H  5.918054 -0.415146 1.085555
