program: Orca
programVersion: 5.0.2
elementType: S S P O O O N C C C C C C C C C C C C C C H H H H H H H H H H H H H H H H H H H H H H H H H H H H
charge: 0
multiplicity: 1
keywords: wb97x-d3
keywords: def2-TZVPP
keywords: def2/J RIJCOSX
keywords: DEFGRID2
keywords: scfconv7
keywords: smallprint printgap noloewdin
keywords: NOSOSCF
formula: C14H28NO3PS2
InChI: InChI=1/C14H28NO3PS2/c1-4-10-17-19(20,18-11-5-2)21-12-14(16)15-9-7-6-8-13(15)3/h13H,4-12H2,1-3H3
49 atoms
S  0.05126 -1.668159 0.041182
S  2.419244 -0.358703 -2.037912
P  1.721228 -0.452852 -0.254553
O  -1.191388 1.19039 -1.90792
O  1.225896 0.906626 0.420537
O  2.70303 -1.051339 0.86604
N  -2.431594 0.575761 -0.118932
C  -2.936796 -0.411272 0.829118
C  -4.468344 -0.434095 0.772555
C  -5.080061 0.949656 0.960836
C  -4.468976 1.93607 -0.026553
C  -2.949006 1.923279 0.058869
C  -2.397141 -0.169173 2.236714
C  -1.558693 0.333448 -1.129214
C  -1.020245 -1.080585 -1.309255
C  1.918479 2.149715 0.247047
C  3.756605 -1.968597 0.547169
C  0.908005 3.274617 0.199248
C  3.25646 -3.376597 0.294178
C  1.601163 4.627989 0.118037
C  2.523196 -3.994294 1.475174
H  -2.590863 -1.396455 0.521799
H  -4.77415 -0.83084 -0.200512
H  -4.843836 -1.129446 1.52717
H  -6.162976 0.898156 0.832036
H  -4.912454 1.300184 1.983585
H  -4.832583 2.948366 0.163401
H  -4.770096 1.677609 -1.045966
H  -2.624396 2.31269 1.029849
H  -2.510886 2.562152 -0.702141
H  -2.769005 0.755296 2.677994
H  -1.309257 -0.125066 2.222365
H  -2.69431 -0.986112 2.895096
H  -0.447743 -1.095763 -2.235969
H  -1.813362 -1.825584 -1.393594
H  2.506479 2.128239 -0.675014
H  2.607594 2.274996 1.08706
H  4.310642 -1.599324 -0.31907
H  4.419728 -1.944515 1.413301
H  0.275566 3.233295 1.08999
H  0.255812 3.126572 -0.663024
H  4.13222 -3.982289 0.044513
H  2.624493 -3.384562 -0.597675
H  2.233659 4.702531 -0.767731
H  0.872596 5.435941 0.065173
H  2.230311 4.811685 0.990697
H  2.206931 -5.011633 1.246484
H  1.63016 -3.429953 1.740652
H  3.16128 -4.037415 2.359487
totalener: -1968.75898568 hartree
nucrepener: 2460.60035868 hartree
electener: -4429.35934436 hartree
oneelecener: -7600.73210804 hartree
twoeener: 3171.37276368 hartree
kineticenergy: 1962.83451106 hartree
xcener: -137.082494374153 hartree
chargesum: -0.0000000
charge: -0.183374 -0.376202 0.619561 -0.399820 -0.306475 -0.342863 -0.054407 -0.026570 -0.135608 -0.126949 -0.132021 -0.115222 -0.256611 0.217662 -0.112652 0.016196 0.004921 -0.071519 -0.134956 -0.257142 -0.226445 0.075424 0.074360 0.075223 0.078029 0.072069 0.072364 0.073839 0.096650 0.108579 0.079039 0.098190 0.084482 0.152869 0.127001 0.084227 0.092201 0.108633 0.094218 0.053182 0.074284 0.070155 0.075882 0.082518 0.086155 0.073722 0.085588 0.079434 0.072177
qa: -0.1834 -0.3762 0.6196 -0.3998 -0.3065 -0.3429 -0.0544 -0.0266 -0.1356 -0.1269 -0.1320 -0.1152 -0.2566 0.2177 -0.1127 0.0162 0.0049 -0.0715 -0.1350 -0.2571 -0.2264 0.0754 0.0744 0.0752 0.0780 0.0721 0.0724 0.0738 0.0966 0.1086 0.0790 0.0982 0.0845 0.1529 0.1270 0.0842 0.0922 0.1086 0.0942 0.0532 0.0743 0.0702 0.0759 0.0825 0.0862 0.0737 0.0856 0.0794 0.0722
va: 2.2579 2.0769 5.4373 2.0967 2.1376 2.1085 3.0745 4.0151 3.9086 3.8750 3.9187 3.8800 3.9205 4.1391 3.8011 3.8791 3.8756 3.8735 3.8698 3.9587 3.9226 1.0088 1.0176 1.0144 1.0142 1.0086 1.0167 1.0143 0.9945 1.0421 1.0049 1.0317 1.0094 1.0386 1.0009 1.0187 0.9969 1.0226 0.9945 1.0092 1.0268 1.0180 1.0252 1.0022 1.0056 1.0035 1.0066 1.0107 1.0051
dispcorr: -0.027487144 hartree
energy: -1968.786472820583
dipole: -14.14803 13.34181 -0.80622 7.52887 -7.87042 -0.34155 14.96090 -13.56566 1.39524
magnitude: 1.64722 au
magnitude: 4.18690 debye
