program: Orca
programVersion: 5.0.2
elementType: Cl O O N C C C C C C C C C C C C C C C C H H H H H H H H H H H H H H H H H H H H H H
charge: 0
multiplicity: 1
keywords: wb97x-d3
keywords: def2-TZVPP
keywords: def2/J RIJCOSX
keywords: DEFGRID2
keywords: scfconv7
keywords: smallprint printgap noloewdin
keywords: NOSOSCF
formula: C16H22ClNO2
InChI: InChI=1/C16H22ClNO2/c1-4-20-11-10-18(15(19)12-17)16(13(2)3)14-8-6-5-7-9-14/h5-9H,4,10-12H2,1-3H3
42 atoms
Cl -0.326589 4.165697 -0.281761
O  -2.659928 -1.348194 -0.067849
O  -1.221854 2.277926 1.934394
N  -0.428638 0.501373 0.788931
C  0.267183 -0.0479 -0.329477
C  -1.14279 -0.437061 1.649975
C  -0.118466 0.224683 -1.585912
C  1.4059 -0.917469 0.040541
C  -2.562814 -0.743005 1.200322
C  -0.479749 1.819665 1.076085
C  -1.325829 1.045013 -1.919603
C  0.644111 -0.220964 -2.795993
C  1.573847 -2.178335 -0.532986
C  2.314564 -0.503597 1.016402
C  0.511142 2.733124 0.377893
C  -2.230356 -2.695451 -0.112256
C  2.63747 -2.99004 -0.165608
C  3.377705 -1.314322 1.383998
C  3.544887 -2.559916 0.79254
C  -2.281694 -3.178774 -1.54204
H  -1.186795 -0.037545 2.662726
H  -0.547236 -1.348985 1.711151
H  -3.027604 -1.371607 1.972216
H  -3.138732 0.183037 1.148822
H  -1.90944 0.53419 -2.688802
H  -1.984772 1.245507 -1.078992
H  -1.028461 2.004183 -2.349118
H  0.10907 -1.01789 -3.318375
H  0.724968 0.609315 -3.501015
H  1.648587 -0.575909 -2.579471
H  0.857646 -2.535777 -1.262574
H  2.196759 0.462833 1.491869
H  1.214253 3.0848 1.13341
H  1.074049 2.273733 -0.426221
H  -2.873636 -3.315462 0.526195
H  -1.208583 -2.803237 0.269056
H  2.748936 -3.965168 -0.621704
H  4.077063 -0.972636 2.135961
H  4.372306 -3.194058 1.082864
H  -3.290494 -3.120028 -1.952298
H  -1.962964 -4.219911 -1.588769
H  -1.615296 -2.598282 -2.183074
elementType: Cl O N C H
totalener: -1288.44103656 hartree
nucrepener: 1802.81598739 hartree
electener: -3091.25702395 hartree
oneelecener: -5343.78460288 hartree
twoeener: 2252.52757894 hartree
cpcmener: -0.03701339 hartree
kineticenergy: 1283.97692804 hartree
xcener: -102.816017680749 hartree
chargesum: 0.0000000
charge: -0.164980 -0.400157 -0.544154 -0.004148 0.105637 -0.093252 0.033489 0.032834 0.016792 0.315134 -0.317991 -0.259533 -0.342147 -0.220289 -0.080550 0.037647 -0.137681 -0.154362 -0.167470 -0.270164 0.103530 0.122035 0.101106 0.102854 0.117801 0.099832 0.107373 0.108438 0.109580 0.105905 0.158901 0.145307 0.160040 0.149530 0.095998 0.084211 0.158754 0.157565 0.160523 0.093630 0.094680 0.077754
qa: -0.1650 -0.4002 -0.5442 -0.0041 0.1056 -0.0933 0.0335 0.0328 0.0168 0.3151 -0.3180 -0.2595 -0.3421 -0.2203 -0.0806 0.0376 -0.1377 -0.1544 -0.1675 -0.2702 0.1035 0.1220 0.1011 0.1029 0.1178 0.0998 0.1074 0.1084 0.1096 0.1059 0.1589 0.1453 0.1600 0.1495 0.0960 0.0842 0.1588 0.1576 0.1605 0.0936 0.0947 0.0778
va: 1.1079 1.8913 1.9633 2.9949 3.4392 3.8101 3.6341 3.2765 3.8753 4.1094 3.9764 3.9139 3.9724 3.9541 3.9770 3.8675 3.9221 3.9124 3.9066 3.9448 1.0348 0.9899 1.0047 1.0073 0.9975 1.0080 1.0095 0.9932 0.9986 1.0034 0.9902 1.0117 1.0021 1.0079 0.9967 0.9733 0.9917 0.9936 0.9895 1.0070 1.0080 0.9998
dispcorr: -0.025851772 hartree
energy: -1288.466888327896
dipole: -3.37314 5.02518 1.65204 -25.30429 22.71252 -2.59177 -8.68943 7.92481 -0.76462
magnitude: 3.16720 au
magnitude: 8.05038 debye
