program: Orca
programVersion: 5.0.2
elementType: Cl O O N C C C C C C C C C C C C C C C C H H H H H H H H H H H H H H H H H H H H H H
charge: 0
multiplicity: 1
keywords: wb97x-d3
keywords: def2-TZVPP
keywords: def2/J RIJCOSX
keywords: DEFGRID2
keywords: scfconv7
keywords: smallprint printgap noloewdin
keywords: NOSOSCF
formula: C16H22ClNO2
InChI: InChI=1/C16H22ClNO2/c1-4-20-11-10-18(15(19)12-17)16(13(2)3)14-8-6-5-7-9-14/h5-9H,4,10-12H2,1-3H3
42 atoms
Cl 0.351728 4.203545 1.059068
O  -2.265232 -1.882685 -0.070588
O  -1.486104 2.09536 1.868707
N  -0.529174 0.430119 0.680297
C  0.1941 -0.000959 -0.469232
C  -1.086601 -0.596314 1.55409
C  -0.280333 0.204126 -1.708217
C  1.460315 -0.699954 -0.152887
C  -2.432154 -1.123586 1.102957
C  -0.74998 1.732099 0.963889
C  -1.630546 0.78232 -1.995456
C  0.498045 -0.119901 -2.946029
C  2.370231 -0.139608 0.745384
C  1.742766 -1.953056 -0.695599
C  -0.0224 2.747062 0.095373
C  -3.484053 -2.254361 -0.679778
C  3.547965 -0.800035 1.062284
C  2.918805 -2.616284 -0.375587
C  3.827365 -2.040163 0.501753
C  -3.184577 -2.999739 -1.958895
H  -1.1837 -0.196473 2.561717
H  -0.3694 -1.417529 1.6128
H  -2.853416 -1.738235 1.910448
H  -3.128118 -0.290302 0.938936
H  -2.156936 0.133859 -2.700536
H  -2.266485 0.909781 -1.12245
H  -1.537916 1.752934 -2.488946
H  0.438603 0.717119 -3.645295
H  1.54899 -0.330057 -2.76366
H  0.063673 -0.98155 -3.458947
H  2.1618 0.824452 1.194844
H  1.028967 -2.420649 -1.36224
H  0.91355 2.375826 -0.310703
H  -0.658138 3.060296 -0.732739
H  -4.089344 -1.363546 -0.893296
H  -4.075499 -2.884475 -0.002131
H  4.248778 -0.346057 1.75084
H  3.118964 -3.590028 -0.803525
H  4.743404 -2.557859 0.754804
H  -2.625626 -2.378172 -2.660692
H  -4.116004 -3.292787 -2.442773
H  -2.608764 -3.906346 -1.768964
elementType: Cl O N C H
totalener: -1288.44305963 hartree
nucrepener: 1776.97762481 hartree
electener: -3065.42068444 hartree
oneelecener: -5292.46692170 hartree
twoeener: 2227.04623726 hartree
cpcmener: -0.03685174 hartree
kineticenergy: 1283.97740568 hartree
xcener: -102.813021588354 hartree
chargesum: -0.0000000
charge: -0.169865 -0.374668 -0.535775 -0.017780 0.086849 -0.035715 0.069486 -0.065576 -0.017813 0.315562 -0.332988 -0.264830 -0.179939 -0.261839 -0.088536 0.030265 -0.178925 -0.164353 -0.146084 -0.257380 0.102810 0.108404 0.104422 0.091460 0.114110 0.107704 0.123752 0.106675 0.103192 0.108272 0.145404 0.151559 0.152345 0.161966 0.082446 0.089714 0.158126 0.158885 0.161449 0.077890 0.092830 0.086489
qa: -0.1699 -0.3747 -0.5358 -0.0178 0.0868 -0.0357 0.0695 -0.0656 -0.0178 0.3156 -0.3330 -0.2648 -0.1799 -0.2618 -0.0885 0.0303 -0.1789 -0.1644 -0.1461 -0.2574 0.1028 0.1084 0.1044 0.0915 0.1141 0.1077 0.1238 0.1067 0.1032 0.1083 0.1454 0.1516 0.1523 0.1620 0.0824 0.0897 0.1581 0.1589 0.1614 0.0779 0.0928 0.0865
va: 1.1049 1.9125 1.9685 3.0144 3.4715 3.8325 3.6342 3.3935 3.9263 4.1021 3.9887 3.9224 3.9125 3.9710 3.9863 3.8720 3.9393 3.9197 3.8814 3.9500 1.0291 1.0086 1.0019 0.9973 0.9942 0.9995 0.9975 0.9986 1.0028 0.9955 1.0067 1.0003 1.0027 1.0059 0.9880 0.9923 0.9938 0.9925 0.9891 1.0025 1.0092 1.0045
dispcorr: -0.023983856 hartree
energy: -1288.467043487506
dipole: -11.52540 11.56477 0.03937 -23.86950 21.92655 -1.94295 -16.79168 14.69694 -2.09474
magnitude: 2.85737 au
magnitude: 7.26285 debye
