program: Orca
programVersion: 5.0.2
elementType: Cl O O N C C C C C C C C C C C C C C C C H H H H H H H H H H H H H H H H H H H H H H
charge: 0
multiplicity: 1
keywords: wb97x-d3
keywords: def2-TZVPP
keywords: def2/J RIJCOSX
keywords: DEFGRID2
keywords: scfconv7
keywords: smallprint printgap noloewdin
keywords: NOSOSCF
formula: C16H22ClNO2
InChI: InChI=1/C16H22ClNO2/c1-4-20-11-10-18(15(19)12-17)16(13(2)3)14-8-6-5-7-9-14/h5-9H,4,10-12H2,1-3H3
42 atoms
Cl -0.610558 3.119535 1.58328
O  -1.870098 -1.356689 1.049743
O  -2.52608 1.505687 -0.058516
N  -0.819769 0.341059 -0.980541
C  0.557092 0.226221 -1.34451
C  -1.676595 -0.805829 -1.267757
C  1.019089 0.839503 -2.443886
C  1.358999 -0.630225 -0.440108
C  -1.614794 -1.901912 -0.21957
C  -1.34756 1.425709 -0.37691
C  0.13892 1.638571 -3.353882
C  2.46378 0.842476 -2.834691
C  1.303427 -0.440257 0.94208
C  2.130082 -1.680804 -0.937284
C  -0.424199 2.603618 -0.118599
C  -1.653871 -2.270658 2.105726
C  2.008829 -1.269535 1.80009
C  2.832806 -2.51436 -0.078781
C  2.772507 -2.313525 1.293353
C  -1.737743 -1.533645 3.420851
H  -1.370558 -1.230169 -2.224218
H  -2.699988 -0.455838 -1.390686
H  -2.357249 -2.666051 -0.487846
H  -0.635496 -2.394867 -0.238861
H  -0.923257 1.44124 -3.224985
H  0.304339 2.708344 -3.200667
H  0.39717 1.434617 -4.394935
H  3.130718 0.482402 -2.054938
H  2.6256 0.232167 -3.72608
H  2.76825 1.858227 -3.096687
H  0.712121 0.3644 1.361027
H  2.161768 -1.862654 -2.004247
H  0.628872 2.406382 -0.282967
H  -0.726649 3.435352 -0.754748
H  -0.667174 -2.741818 2.002615
H  -2.39636 -3.07893 2.072068
H  1.957041 -1.10287 2.868363
H  3.41695 -3.330804 -0.483177
H  3.313971 -2.967446 1.964465
H  -2.716946 -1.075441 3.565163
H  -0.979765 -0.751215 3.486177
H  -1.571415 -2.227715 4.244088
elementType: Cl O N C H
totalener: -1288.44078881 hartree
nucrepener: 1815.91905301 hartree
electener: -3104.35984182 hartree
oneelecener: -5371.10563478 hartree
twoeener: 2266.74579297 hartree
cpcmener: -0.04385714 hartree
kineticenergy: 1283.98665093 hartree
xcener: -102.815954873240 hartree
chargesum: -0.0000000
charge: -0.167067 -0.384794 -0.543357 -0.023930 -0.005585 -0.038770 0.115813 -0.004460 -0.009679 0.301565 -0.302950 -0.259422 -0.179982 -0.259793 -0.085410 0.032877 -0.201232 -0.149290 -0.139761 -0.257277 0.114492 0.103650 0.114159 0.092588 0.100998 0.111311 0.113718 0.102586 0.111176 0.106206 0.123842 0.152149 0.151526 0.159614 0.075463 0.095717 0.156281 0.159212 0.160816 0.089828 0.075794 0.091379
qa: -0.1671 -0.3848 -0.5434 -0.0239 -0.0056 -0.0388 0.1158 -0.0045 -0.0097 0.3016 -0.3030 -0.2594 -0.1800 -0.2598 -0.0854 0.0329 -0.2012 -0.1493 -0.1398 -0.2573 0.1145 0.1036 0.1142 0.0926 0.1010 0.1113 0.1137 0.1026 0.1112 0.1062 0.1238 0.1521 0.1515 0.1596 0.0755 0.0957 0.1563 0.1592 0.1608 0.0898 0.0758 0.0914
va: 1.1091 1.9183 1.9610 3.0195 3.5984 3.8159 3.6472 3.3981 3.9424 4.1510 3.9720 3.9063 3.8520 3.9535 3.9612 3.8678 3.9227 3.9032 3.8789 3.9514 1.0057 1.0273 1.0022 0.9876 1.0056 0.9931 0.9983 1.0027 0.9954 0.9985 1.0305 0.9992 1.0074 1.0020 0.9879 0.9937 0.9949 0.9913 0.9885 1.0047 1.0036 1.0086
dispcorr: -0.025243911 hartree
energy: -1288.466032720336
dipole: 4.94295 -2.53475 2.40820 -15.81949 14.18894 -1.63055 -8.13268 5.98636 -2.14632
magnitude: 3.61453 au
magnitude: 9.18740 debye
