program: Orca
programVersion: 5.0.2
elementType: Cl O O N C C C C C C C C C C C C C C C C H H H H H H H H H H H H H H H H H H H H H H
charge: 0
multiplicity: 1
keywords: wb97x-d3
keywords: def2-TZVPP
keywords: def2/J RIJCOSX
keywords: DEFGRID2
keywords: scfconv7
keywords: smallprint printgap noloewdin
keywords: NOSOSCF
formula: C16H22ClNO2
InChI: InChI=1/C16H22ClNO2/c1-4-20-11-10-18(15(19)12-17)16(13(2)3)14-8-6-5-7-9-14/h5-9H,4,10-12H2,1-3H3
42 atoms
Cl 0.592593 4.140625 1.132435
O  -3.060864 -2.012193 1.004301
O  -1.448531 2.089702 1.55206
N  -0.446967 0.469124 0.341894
C  0.412636 0.06973 -0.723348
C  -1.177309 -0.590971 1.022246
C  0.10897 0.346956 -2.001893
C  1.607763 -0.681322 -0.273739
C  -2.463861 -0.949562 0.29722
C  -0.627447 1.755107 0.712348
C  -1.16031 1.018788 -2.42544
C  1.027007 0.041111 -3.145542
C  1.960797 -1.898504 -0.856043
C  2.376859 -0.202321 0.788989
C  0.254531 2.784647 0.023301
C  -4.305304 -2.431951 0.476723
C  3.070811 -2.602863 -0.411717
C  3.488734 -0.90339 1.230183
C  3.841138 -2.105799 0.630416
C  -4.18637 -3.240025 -0.800782
H  -1.386309 -0.290426 2.048183
H  -0.526872 -1.466585 1.068371
H  -3.134836 -0.080604 0.260733
H  -2.235822 -1.230047 -0.738308
H  -1.618111 0.450998 -3.238717
H  -1.90111 1.125869 -1.636834
H  -0.949888 2.012695 -2.828377
H  0.642972 -0.793685 -3.736109
H  1.070496 0.900488 -3.817873
H  2.042729 -0.200371 -2.84266
H  1.352371 -2.307625 -1.652588
H  2.112628 0.730177 1.273587
H  1.209811 2.385753 -0.303835
H  -0.262614 3.192201 -0.845783
H  -4.959925 -1.566198 0.314278
H  -4.77009 -3.04246 1.253388
H  3.325879 -3.547811 -0.873443
H  4.079902 -0.510298 2.04705
H  4.705607 -2.655041 0.979757
H  -5.173419 -3.597901 -1.095981
H  -3.545906 -4.111585 -0.659307
H  -3.791044 -2.654728 -1.631597
elementType: Cl O N C H
totalener: -1288.44113039 hartree
nucrepener: 1735.93078243 hartree
electener: -3024.37191282 hartree
oneelecener: -5209.72197295 hartree
twoeener: 2185.35006013 hartree
cpcmener: -0.03947744 hartree
kineticenergy: 1283.96932539 hartree
xcener: -102.812022786693 hartree
chargesum: 0.0000000
charge: -0.167709 -0.401952 -0.533357 -0.049242 0.067189 0.002326 0.112452 -0.083798 -0.003884 0.315819 -0.328682 -0.267535 -0.251204 -0.181420 -0.087452 0.045311 -0.164338 -0.180976 -0.142913 -0.258718 0.098841 0.108101 0.084451 0.097318 0.118184 0.101111 0.117017 0.111619 0.105112 0.104008 0.156212 0.142094 0.151500 0.163260 0.069176 0.095775 0.158768 0.158336 0.161828 0.091041 0.081836 0.084494
qa: -0.1677 -0.4020 -0.5334 -0.0492 0.0672 0.0023 0.1125 -0.0838 -0.0039 0.3158 -0.3287 -0.2675 -0.2512 -0.1814 -0.0875 0.0453 -0.1643 -0.1810 -0.1429 -0.2587 0.0988 0.1081 0.0845 0.0973 0.1182 0.1011 0.1170 0.1116 0.1051 0.1040 0.1562 0.1421 0.1515 0.1633 0.0692 0.0958 0.1588 0.1583 0.1618 0.0910 0.0818 0.0845
va: 1.1068 1.9296 1.9730 3.0274 3.5492 3.7281 3.6003 3.4502 3.9407 4.1138 3.9855 3.9233 3.9590 3.9162 3.9887 3.9149 3.9141 3.9441 3.8806 3.8902 1.0310 1.0129 1.0041 0.9738 0.9958 1.0057 0.9955 0.9954 0.9994 1.0021 0.9968 1.0089 1.0025 1.0034 0.9986 0.9914 0.9929 0.9940 0.9890 1.0103 1.0075 1.0020
dispcorr: -0.022047664 hartree
energy: -1288.463178053424
dipole: -12.39504 12.97716 0.58212 -23.18348 21.52346 -1.66002 -17.33548 14.25942 -3.07606
magnitude: 3.54354 au
magnitude: 9.00697 debye
