program: Orca
programVersion: 5.0.2
elementType: Cl O O N C C C C C C C C C C C C C C C C H H H H H H H H H H H H H H H H H H H H H H
charge: 0
multiplicity: 1
keywords: wb97x-d3
keywords: def2-TZVPP
keywords: def2/J RIJCOSX
keywords: DEFGRID2
keywords: scfconv7
keywords: smallprint printgap noloewdin
keywords: NOSOSCF
formula: C16H22ClNO2
InChI: InChI=1/C16H22ClNO2/c1-4-20-11-10-18(15(19)12-17)16(13(2)3)14-8-6-5-7-9-14/h5-9H,4,10-12H2,1-3H3
42 atoms
Cl 0.703372 4.201533 0.884855
O  -2.855132 -1.365587 -0.030499
O  -1.309776 2.322037 1.847718
N  -0.637166 0.551776 0.62057
C  0.030731 0.013957 -0.518483
C  -1.235104 -0.397583 1.55388
C  -0.426274 0.223679 -1.763454
C  1.239679 -0.772156 -0.179649
C  -2.673962 -0.766226 1.231254
C  -0.682419 1.87188 0.900307
C  -1.697387 0.951866 -2.069177
C  0.305562 -0.225829 -2.991118
C  1.448424 -2.049212 -0.700349
C  2.175644 -0.256825 0.719412
C  0.100214 2.791284 -0.024801
C  -2.363388 -2.68851 -0.13548
C  2.577718 -2.779335 -0.357285
C  3.306024 -0.984325 1.059414
C  3.512076 -2.248255 0.521192
C  -2.469174 -3.136756 -1.57396
H  -1.208882 0.015386 2.561728
H  -0.600619 -1.284758 1.575239
H  -3.039102 -1.420226 2.034872
H  -3.293716 0.132647 1.240537
H  -2.307589 1.179444 -1.198956
H  -1.481267 1.890172 -2.585867
H  -2.301237 0.357557 -2.759082
H  0.313146 0.579706 -3.728507
H  1.335216 -0.522572 -2.807983
H  -0.210675 -1.067783 -3.459282
H  0.71423 -2.48306 -1.368073
H  2.027214 0.72504 1.153474
H  0.957229 2.310701 -0.486411
H  -0.549863 3.164605 -0.8160
H  -2.93976 -3.356363 0.518306
H  -1.318609 -2.755014 0.18832
H  2.720489 -3.770028 -0.768839
H  4.026344 -0.563788 1.74907
H  4.391354 -2.818037 0.791927
H  -2.103521 -4.159154 -1.668083
H  -1.86782 -2.507073 -2.232824
H  -3.500494 -3.117844 -1.928419
elementType: Cl O N C H
totalener: -1288.44221437 hartree
nucrepener: 1797.29678133 hartree
electener: -3085.73899571 hartree
oneelecener: -5332.57746543 hartree
twoeener: 2246.83846972 hartree
cpcmener: -0.03787105 hartree
kineticenergy: 1283.97526413 hartree
xcener: -102.816366010815 hartree
chargesum: 0.0000000
charge: -0.168028 -0.402415 -0.536985 -0.009666 0.115789 -0.094499 0.037872 0.010179 0.021719 0.318840 -0.324975 -0.257341 -0.333040 -0.215375 -0.088846 0.037925 -0.140296 -0.157361 -0.165874 -0.273092 0.102864 0.121218 0.099706 0.102178 0.102887 0.117250 0.114537 0.108743 0.106209 0.108111 0.158582 0.140588 0.152803 0.162079 0.097408 0.084399 0.158517 0.157987 0.160575 0.096129 0.078159 0.094538
qa: -0.1680 -0.4024 -0.5370 -0.0097 0.1158 -0.0945 0.0379 0.0102 0.0217 0.3188 -0.3250 -0.2573 -0.3330 -0.2154 -0.0888 0.0379 -0.1403 -0.1574 -0.1659 -0.2731 0.1029 0.1212 0.0997 0.1022 0.1029 0.1173 0.1145 0.1087 0.1062 0.1081 0.1586 0.1406 0.1528 0.1621 0.0974 0.0844 0.1585 0.1580 0.1606 0.0961 0.0782 0.0945
va: 1.1072 1.8925 1.9688 3.0028 3.4063 3.8149 3.6594 3.2904 3.8798 4.0966 3.9937 3.9144 3.9747 3.9522 3.9871 3.8662 3.9250 3.9199 3.9039 3.9433 1.0357 0.9897 1.0045 1.0051 1.0054 0.9971 0.9958 0.9996 1.0030 0.9928 0.9907 1.0100 1.0028 1.0048 0.9968 0.9734 0.9921 0.9933 0.9895 1.0084 0.9986 1.0070
dispcorr: -0.025542384 hartree
energy: -1288.467756757948
dipole: -9.10267 9.88819 0.78552 -25.64159 23.04947 -2.59212 -14.48587 12.70645 -1.77942
magnitude: 3.24075 au
magnitude: 8.23734 debye
