program: Orca
programVersion: 5.0.2
elementType: Cl O O N C C C C C C C C C C C C C C C C H H H H H H H H H H H H H H H H H H H H H H
charge: 0
multiplicity: 1
keywords: wb97x-d3
keywords: def2-TZVPP
keywords: def2/J RIJCOSX
keywords: DEFGRID2
keywords: scfconv7
keywords: smallprint printgap noloewdin
keywords: NOSOSCF
formula: C16H22ClNO2
InChI: InChI=1/C16H22ClNO2/c1-4-20-11-10-18(15(19)12-17)16(13(2)3)14-8-6-5-7-9-14/h5-9H,4,10-12H2,1-3H3
42 atoms
Cl 0.214992 3.883792 1.248576
O  -3.133584 -1.075466 0.434034
O  -1.644199 1.648307 1.786281
N  -0.476666 0.178397 0.524444
C  0.36009 -0.11169 -0.591446
C  -0.915257 -0.971724 1.309827
C  -0.037755 0.115518 -1.85335
C  1.666625 -0.698706 -0.213361
C  -1.951136 -1.819851 0.609789
C  -0.852556 1.425897 0.882066
C  -1.396736 0.623984 -2.218641
C  0.865999 -0.065687 -3.03423
C  2.45249 -0.080206 0.760021
C  2.10803 -1.898851 -0.768824
C  -0.230158 2.578804 0.111094
C  -4.208737 -1.823785 -0.102514
C  3.663604 -0.634631 1.145659
C  3.318012 -2.456158 -0.380084
C  4.100336 -1.824843 0.577027
C  -4.022563 -2.235901 -1.550342
H  -1.283362 -0.629857 2.274588
H  -0.046111 -1.601984 1.508135
H  -1.550177 -2.18011 -0.3456
H  -2.136878 -2.706437 1.231286
H  -1.797173 0.032716 -3.045255
H  -2.119781 0.59685 -1.408002
H  -1.333374 1.652771 -2.583279
H  0.557764 -0.928538 -3.628932
H  0.78879 0.804419 -3.689948
H  1.912835 -0.194898 -2.771108
H  2.117918 0.844512 1.216128
H  1.49156 -2.40919 -1.498413
H  0.665403 2.312236 -0.439908
H  -0.960137 2.987329 -0.587402
H  -5.089287 -1.185097 -0.014872
H  -4.393114 -2.712344 0.515269
H  4.267161 -0.138483 1.894444
H  3.642549 -3.391599 -0.817045
H  5.041749 -2.261379 0.884037
H  -3.835904 -1.372774 -2.190979
H  -4.933044 -2.720862 -1.904566
H  -3.205911 -2.945731 -1.684741
elementType: Cl O N C H
totalener: -1288.44115536 hartree
nucrepener: 1770.01709735 hartree
electener: -3058.45825271 hartree
oneelecener: -5278.54232251 hartree
twoeener: 2220.08406981 hartree
cpcmener: -0.04214763 hartree
kineticenergy: 1283.98288271 hartree
xcener: -102.815908684783 hartree
chargesum: -0.0000000
charge: -0.170175 -0.390096 -0.537199 -0.018537 0.020321 -0.046379 0.142532 -0.059589 -0.004247 0.307977 -0.355650 -0.266440 -0.172759 -0.249826 -0.087492 0.036683 -0.177440 -0.165526 -0.145762 -0.272613 0.102059 0.114453 0.096945 0.108122 0.119085 0.098125 0.124415 0.110907 0.106730 0.102214 0.137579 0.154568 0.153076 0.158704 0.094472 0.075931 0.158829 0.158844 0.161448 0.082252 0.102175 0.091286
qa: -0.1702 -0.3901 -0.5372 -0.0185 0.0203 -0.0464 0.1425 -0.0596 -0.0042 0.3080 -0.3557 -0.2664 -0.1728 -0.2498 -0.0875 0.0367 -0.1774 -0.1655 -0.1458 -0.2726 0.1021 0.1145 0.0969 0.1081 0.1191 0.0981 0.1244 0.1109 0.1067 0.1022 0.1376 0.1546 0.1531 0.1587 0.0945 0.0759 0.1588 0.1588 0.1614 0.0823 0.1022 0.0913
va: 1.1031 1.9181 1.9710 3.0025 3.5600 3.8675 3.5452 3.4347 3.9111 4.1215 3.9556 3.9182 3.9089 3.9582 3.9667 3.8929 3.9388 3.9196 3.8790 3.8935 1.0365 1.0013 0.9780 1.0012 0.9927 1.0287 0.9950 0.9958 0.9983 1.0032 1.0156 0.9975 1.0064 1.0056 0.9927 0.9997 0.9933 0.9926 0.9892 1.0039 1.0116 0.9986
dispcorr: -0.023643184 hartree
energy: -1288.464798539611
dipole: -9.93099 10.89428 0.96329 -23.04153 20.49766 -2.54388 -18.06506 15.39406 -2.67100
magnitude: 3.81228 au
magnitude: 9.69005 debye
